{"text_format":"3","workbook":"xlsx","n_sheets":5,"sheets":["地市透视表","汇总","金华","嘉兴","杭州"],"not_rendered":{"images":5,"external_links":1,"defined_names":5},"read":"whole","date_system":"1900"}

{"sheet":"地市透视表","index":0,"n_rows":5,"n_cols":6,"rows_kept":5,"merged":[[0,11,0,15]]}
["地市","资产条数","资产原值（元）","资产净值（元）","净值/原值","评估价（元）"]
["金华",94,388406.17,12622.12,{"$f":"D2/C2","v":{"v":0.0324972180539769,"d":"3.25%"}},25222.34]
["嘉兴",77,684970.69,219640.66,{"$f":"D3/C3","v":{"v":0.320657019645614,"d":"32.07%"}},{"v":25554.26861,"d":"25554.27"}]
["杭州",212,805025.94,93969.38,{"$f":"D4/C4","v":{"v":0.11672838765916,"d":"11.67%"}},{"v":121828.2688,"d":"121828.27"}]
["合计",{"$f":"SUM(B2:B4)","v":383},{"$f":"SUM(C2:C4)","v":{"v":1878402.8,"d":"1878402.80"}},{"$f":"SUM(D2:D4)","v":326232.16},{"$f":"D5/C5","v":{"v":0.173675294777031,"d":"17.37%"}},{"$f":"SUM(F2:F4)","v":{"v":172604.87741,"d":"172604.88"}}]

{"sheet":"汇总","index":1,"n_rows":57,"n_cols":11,"rows_kept":57}
["地市","拍卖批次","资产类别名称（大类相同完整度不同的分行填报）","对应估值清单的分类描述","计量单位","资产数量","总重量（kg）","完整度/出铜（铝）率（%）","最低转让单价（含税）","最低转让总价（含税）","备注\n（主要配件缺失的需要注明）"]
["金华","第二十八批","3P空调","3匹室内外成套","套",18,null,null,936,{"$f":"F2*I2","v":{"v":16848,"d":"16848.00"}},"铜管"]
["金华","第二十八批","壁挂空调","2P及2P以下成套空调","套",4,null,null,520,{"v":2080,"d":"2080.00"},"铜管"]
["金华","第二十八批","电线电缆","铜缆类","根",5,15,{"v":0.5,"d":"50%"},"70510元/吨×出铜率",{"$f":"70510/1000*H4*G4","v":{"v":528.825,"d":"528.83"}}]
["金华","第二十八批","动环监控","动环监控","个",54,189,null,16,{"v":864,"d":"864.00"}]
["金华","第二十八批","接地汇流排","其他各类铁质为主的报废物资","个",2,3,null,"2270元/吨",{"$f":"2270/1000*G6","v":6.81}]
["金华","第二十八批","模块","其他各类铁质为主的报废物资","个",2,3,null,"2270元/吨",6.81]
["金华","第二十八批","嵌入式开关电源","其他各类铁质为主的报废物资","个",2,40,null,"2270元/吨",90.8,"模块"]
["金华","第二十八批","走线架","其他各类铁质为主的报废物资","个",1,10,null,"2270元/吨",22.7]
["金华","第二十八批","组合式开关电源","组合开关电源柜","个",8,320,{"v":0.4,"d":"40%"},"997×完整度+198",{"$f":"(997*H10+198)*F10","v":{"v":4774.4,"d":"4774.40"}},"模块"]
["嘉兴","第二十八批","铜线","铜缆类","根",2,1.1,{"v":0.23,"d":"23%"},"70510元/吨×出铜率",{"$f":"70510/1000*H11*G11","v":{"v":17.83903,"d":"17.84"}},"称重"]
["嘉兴","第二十八批","空调","2P及2P以下成套空调","台",1,null,null,520,{"$f":"F12*I12","v":{"v":520,"d":"520.00"}},"套用单价/含铜管"]
["嘉兴","第二十八批","空调","3匹室内外成套","台",24,null,null,936,{"v":22464,"d":"22464.00"},"套用单价/含铜管"]
["嘉兴","第二十八批","监控","动环监控","个",6,null,null,16,{"v":96,"d":"96.00"},"套用单价"]
["嘉兴","第二十八批","空调控制器","其他各类铁质为主的报废物资","个",1,0.3,null,"2270元/吨",{"$f":"2270/1000*G15","v":{"v":0.681,"d":"0.68"}},"称重"]
["嘉兴","第二十八批","电表","其他各类铁质为主的报废物资","个",3,4.6,null,"2270元/吨",{"v":10.442,"d":"10.44"},"称重"]
["嘉兴","第二十八批","交流配电箱","配电箱类","个",3,null,null,107,{"$f":"F17*I17","v":{"v":321,"d":"321.00"}},"套用单价"]
["嘉兴","第二十八批","供电计量设备","其他各类铁质为主的报废物资","个",1,5.9,null,"2270元/吨",{"v":13.393,"d":"13.39"},"称重"]
["嘉兴","第二十八批","传感器","其他各类铁质为主的报废物资","个",1,0.3,null,"2270元/吨",{"v":0.681,"d":"0.68"},"称重"]
["嘉兴","第二十八批","模块","其他各类铁质为主的报废物资","个",1,2.4,null,"2270元/吨",{"v":5.448,"d":"5.45"},"称重"]
{"$rows_left_out":38}
{"sheet":"金华","index":2,"n_rows":95,"n_cols":18,"rows_kept":95}
["序号","报废批复文号","资产编号","资产名称","资产类别名称","资产原值\n（元，不含税）","累计折旧","资产数量","资产净值\n（元，不含税）","计量单位\n（个/吨/米等）","单节电池电压（2V/12V）","规格型号","生产厂家","站点名称","站点编码","县市","年份","报废批次"]
[1,"2024年8月19日总经理专题办公会议纪要","330700317921",{"$f":"VLOOKUP(C:C,'[1]2024B1-B6清单'!$A:$D,4,0)","v":"普通空调柜式"},{"$f":"VLOOKUP(C:C,'[1]2024B1-B6清单'!$A:$E,5,0)","v":"空调"},{"$f":"VLOOKUP(C:C,'[1]2024B1-B6清单'!$A:$X,24,0)","v":6734.84},{"$f":"VLOOKUP(C:C,'[1]2024B1-B6清单'!$A:$Y,25,0)","v":6532.79},1,{"$f":"VLOOKUP(C:C,'[1]2024B1-B6清单'!$A:$Z,26,0)","v":202.05},"台",null,"3P",null,{"$f":"VLOOKUP(C:C,'[1]2024B1-B6清单'!$A:$P,16,0)","v":"官清畈北"},{"$f":"VLOOKUP(C:C,'[1]2024B1-B6清单'!$A:$Q,17,0)","v":"33078201000486"},{"$f":"VLOOKUP(C:C,'[1]2024B1-B6清单'!$A:$C,3,0)","v":"武义"},2024,"2024B6"]
[2,"2024年8月19日总经理专题办公会议纪要","330700173631",{"$f":"VLOOKUP(C:C,'[1]2024B1-B6清单'!$A:$D,4,0)","v":"专用空调"},{"$f":"VLOOKUP(C:C,'[1]2024B1-B6清单'!$A:$E,5,0)","v":"空调"},{"$f":"VLOOKUP(C:C,'[1]2024B1-B6清单'!$A:$X,24,0)","v":2125.45},{"$f":"VLOOKUP(C:C,'[1]2024B1-B6清单'!$A:$Y,25,0)","v":2061.69},1,{"$f":"VLOOKUP(C:C,'[1]2024B1-B6清单'!$A:$Z,26,0)","v":63.76},"台",null,"3P",null,{"$f":"VLOOKUP(C:C,'[1]2024B1-B6清单'!$A:$P,16,0)","v":"义乌畈田王"},{"$f":"VLOOKUP(C:C,'[1]2024B1-B6清单'!$A:$Q,17,0)","v":"330782908000000784"},{"$f":"VLOOKUP(C:C,'[1]2024B1-B6清单'!$A:$C,3,0)","v":"义乌"},2024,"2024B6"]
[3,"2024年8月19日总经理专题办公会议纪要","330700113004",{"$f":"VLOOKUP(C:C,'[1]2024B1-B6清单'!$A:$D,4,0)","v":"专用空调"},{"$f":"VLOOKUP(C:C,'[1]2024B1-B6清单'!$A:$E,5,0)","v":"空调"},{"$f":"VLOOKUP(C:C,'[1]2024B1-B6清单'!$A:$X,24,0)","v":4970},{"$f":"VLOOKUP(C:C,'[1]2024B1-B6清单'!$A:$Y,25,0)","v":4820.9},1,{"$f":"VLOOKUP(C:C,'[1]2024B1-B6清单'!$A:$Z,26,0)","v":149.1},"台",null,"3P",null,{"$f":"VLOOKUP(C:C,'[1]2024B1-B6清单'!$A:$P,16,0)","v":"义乌南门街"},{"$f":"VLOOKUP(C:C,'[1]2024B1-B6清单'!$A:$Q,17,0)","v":"330782908000001132"},{"$f":"VLOOKUP(C:C,'[1]2024B1-B6清单'!$A:$C,3,0)","v":"义乌"},2024,"2024B6"]
[4,"2024年8月19日总经理专题办公会议纪要","330700340097",{"$f":"VLOOKUP(C:C,'[1]2024B1-B6清单'!$A:$D,4,0)","v":"普通空调壁挂"},{"$f":"VLOOKUP(C:C,'[1]2024B1-B6清单'!$A:$E,5,0)","v":"空调"},{"$f":"VLOOKUP(C:C,'[1]2024B1-B6清单'!$A:$X,24,0)","v":3693.29},{"$f":"VLOOKUP(C:C,'[1]2024B1-B6清单'!$A:$Y,25,0)","v":3582.49},1,{"$f":"VLOOKUP(C:C,'[1]2024B1-B6清单'!$A:$Z,26,0)","v":110.8},"台",null,"3P",null,{"$f":"VLOOKUP(C:C,'[1]2024B1-B6清单'!$A:$P,16,0)","v":"义乌南门街"},{"$f":"VLOOKUP(C:C,'[1]2024B1-B6清单'!$A:$Q,17,0)","v":"330782908000001132"},{"$f":"VLOOKUP(C:C,'[1]2024B1-B6清单'!$A:$C,3,0)","v":"义乌"},2024,"2024B6"]
[5,"2024年8月19日总经理专题办公会议纪要","330700112916",{"$f":"VLOOKUP(C:C,'[1]2024B1-B6清单'!$A:$D,4,0)","v":"专用空调"},{"$f":"VLOOKUP(C:C,'[1]2024B1-B6清单'!$A:$E,5,0)","v":"空调"},{"$f":"VLOOKUP(C:C,'[1]2024B1-B6清单'!$A:$X,24,0)","v":2447.26},{"$f":"VLOOKUP(C:C,'[1]2024B1-B6清单'!$A:$Y,25,0)","v":2373.84},1,{"$f":"VLOOKUP(C:C,'[1]2024B1-B6清单'!$A:$Z,26,0)","v":73.42},"台",null,"3P",null,{"$f":"VLOOKUP(C:C,'[1]2024B1-B6清单'!$A:$P,16,0)","v":"义乌上西陶二"},{"$f":"VLOOKUP(C:C,'[1]2024B1-B6清单'!$A:$Q,17,0)","v":"330782908000001492"},{"$f":"VLOOKUP(C:C,'[1]2024B1-B6清单'!$A:$C,3,0)","v":"义乌"},2024,"2024B6"]
[6,"2024年8月19日总经理专题办公会议纪要","330700143513",{"$f":"VLOOKUP(C:C,'[1]2024B1-B6清单'!$A:$D,4,0)","v":"专用空调"},{"$f":"VLOOKUP(C:C,'[1]2024B1-B6清单'!$A:$E,5,0)","v":"空调"},{"$f":"VLOOKUP(C:C,'[1]2024B1-B6清单'!$A:$X,24,0)","v":684},{"$f":"VLOOKUP(C:C,'[1]2024B1-B6清单'!$A:$Y,25,0)","v":663.48},1,{"$f":"VLOOKUP(C:C,'[1]2024B1-B6清单'!$A:$Z,26,0)","v":20.52},"台",null,"3P",null,{"$f":"VLOOKUP(C:C,'[1]2024B1-B6清单'!$A:$P,16,0)","v":"义乌苏溪东湖门"},{"$f":"VLOOKUP(C:C,'[1]2024B1-B6清单'!$A:$Q,17,0)","v":"330782908000002293"},{"$f":"VLOOKUP(C:C,'[1]2024B1-B6清单'!$A:$C,3,0)","v":"义乌"},2024,"2024B6"]
[7,"2024 年金华分公司第23次党委会会议纪要（金华铁塔党委会纪要〔2024〕第25期）","330700151232",{"$f":"VLOOKUP(C:C,'[1]2024B1-B6清单'!$A:$D,4,0)","v":"专用空调"},{"$f":"VLOOKUP(C:C,'[1]2024B1-B6清单'!$A:$E,5,0)","v":"空调"},{"$f":"VLOOKUP(C:C,'[1]2024B1-B6清单'!$A:$X,24,0)","v":3613.5},{"$f":"VLOOKUP(C:C,'[1]2024B1-B6清单'!$A:$Y,25,0)","v":3505.09},1,{"$f":"VLOOKUP(C:C,'[1]2024B1-B6清单'!$A:$Z,26,0)","v":108.41},"台",null,"3P",null,{"$f":"VLOOKUP(C:C,'[1]2024B1-B6清单'!$A:$P,16,0)","v":"义乌苏溪开发区四"},{"$f":"VLOOKUP(C:C,'[1]2024B1-B6清单'!$A:$Q,17,0)","v":"330782908000001015"},{"$f":"VLOOKUP(C:C,'[1]2024B1-B6清单'!$A:$C,3,0)","v":"义乌"},2024,"2024B4"]
[8,"2024 年金华分公司第23次党委会会议纪要（金华铁塔党委会纪要〔2024〕第25期）","330700168919",{"$f":"VLOOKUP(C:C,'[1]2024B1-B6清单'!$A:$D,4,0)","v":"专用空调"},{"$f":"VLOOKUP(C:C,'[1]2024B1-B6清单'!$A:$E,5,0)","v":"空调"},{"$f":"VLOOKUP(C:C,'[1]2024B1-B6清单'!$A:$X,24,0)","v":11360},{"$f":"VLOOKUP(C:C,'[1]2024B1-B6清单'!$A:$Y,25,0)","v":11019.2},1,{"$f":"VLOOKUP(C:C,'[1]2024B1-B6清单'!$A:$Z,26,0)","v":340.8},"台",null,"3P",null,{"$f":"VLOOKUP(C:C,'[1]2024B1-B6清单'!$A:$P,16,0)","v":"义乌苏溪开发区四"},{"$f":"VLOOKUP(C:C,'[1]2024B1-B6清单'!$A:$Q,17,0)","v":"330782908000001015"},{"$f":"VLOOKUP(C:C,'[1]2024B1-B6清单'!$A:$C,3,0)","v":"义乌"},2024,"2024B4"]
[9,"2024 年金华分公司第24次党委会会议纪要（金华铁塔党委会纪要〔2024〕第26期）","330700007976",{"$f":"VLOOKUP(C:C,'[1]2024B1-B6清单'!$A:$D,4,0)","v":"空调"},{"$f":"VLOOKUP(C:C,'[1]2024B1-B6清单'!$A:$E,5,0)","v":"空调"},{"$f":"VLOOKUP(C:C,'[1]2024B1-B6清单'!$A:$X,24,0)","v":11012.44},{"$f":"VLOOKUP(C:C,'[1]2024B1-B6清单'!$A:$Y,25,0)","v":10682.07},1,{"$f":"VLOOKUP(C:C,'[1]2024B1-B6清单'!$A:$Z,26,0)","v":330.37},"台",null,"3P",null,{"$f":"VLOOKUP(C:C,'[1]2024B1-B6清单'!$A:$P,16,0)","v":"义乌张宅一村"},{"$f":"VLOOKUP(C:C,'[1]2024B1-B6清单'!$A:$Q,17,0)","v":"33078200000085"},{"$f":"VLOOKUP(C:C,'[1]2024B1-B6清单'!$A:$C,3,0)","v":"义乌"},2024,"2024B5"]
[10,"2024年8月19日总经理专题办公会议纪要","330700121275",{"$f":"VLOOKUP(C:C,'[1]2024B1-B6清单'!$A:$D,4,0)","v":"专用空调"},{"$f":"VLOOKUP(C:C,'[1]2024B1-B6清单'!$A:$E,5,0)","v":"空调"},{"$f":"VLOOKUP(C:C,'[1]2024B1-B6清单'!$A:$X,24,0)","v":1355.46},{"$f":"VLOOKUP(C:C,'[1]2024B1-B6清单'!$A:$Y,25,0)","v":1314.8},1,{"$f":"VLOOKUP(C:C,'[1]2024B1-B6清单'!$A:$Z,26,0)","v":40.66},"台",null,"3P",null,{"$f":"VLOOKUP(C:C,'[1]2024B1-B6清单'!$A:$P,16,0)","v":"义乌赵朱"},{"$f":"VLOOKUP(C:C,'[1]2024B1-B6清单'!$A:$Q,17,0)","v":"330782908000001478"},{"$f":"VLOOKUP(C:C,'[1]2024B1-B6清单'!$A:$C,3,0)","v":"义乌"},2024,"2024B6"]
[11,"2024年8月19日总经理专题办公会议纪要","330700341526",{"$f":"VLOOKUP(C:C,'[1]2024B1-B6清单'!$A:$D,4,0)","v":"普通空调柜式"},{"$f":"VLOOKUP(C:C,'[1]2024B1-B6清单'!$A:$E,5,0)","v":"空调"},{"$f":"VLOOKUP(C:C,'[1]2024B1-B6清单'!$A:$X,24,0)","v":6180.47},{"$f":"VLOOKUP(C:C,'[1]2024B1-B6清单'!$A:$Y,25,0)","v":5995.06},1,{"$f":"VLOOKUP(C:C,'[1]2024B1-B6清单'!$A:$Z,26,0)","v":185.41},"台",null,"3P",null,{"$f":"VLOOKUP(C:C,'[1]2024B1-B6清单'!$A:$P,16,0)","v":"义乌制证中心"},{"$f":"VLOOKUP(C:C,'[1]2024B1-B6清单'!$A:$Q,17,0)","v":"330782908000000741"},{"$f":"VLOOKUP(C:C,'[1]2024B1-B6清单'!$A:$C,3,0)","v":"义乌"},2024,"2024B6"]
[12,"2024年8月19日总经理专题办公会议纪要","330700300934",{"$f":"VLOOKUP(C:C,'[1]2024B1-B6清单'!$A:$D,4,0)","v":"开关电源"},{"$f":"VLOOKUP(C:C,'[1]2024B1-B6清单'!$A:$E,5,0)","v":"开关电源"},{"$f":"VLOOKUP(C:C,'[1]2024B1-B6清单'!$A:$X,24,0)","v":3810.75},{"$f":"VLOOKUP(C:C,'[1]2024B1-B6清单'!$A:$Y,25,0)","v":3696.43},1,{"$f":"VLOOKUP(C:C,'[1]2024B1-B6清单'!$A:$Z,26,0)","v":114.32},"架",null,"组合式",null,{"$f":"VLOOKUP(C:C,'[1]2024B1-B6清单'!$A:$P,16,0)","v":"义乌枫溪"},{"$f":"VLOOKUP(C:C,'[1]2024B1-B6清单'!$A:$Q,17,0)","v":"330782908000002657"},{"$f":"VLOOKUP(C:C,'[1]2024B1-B6清单'!$A:$C,3,0)","v":"义乌"},2024,"2024B6"]
[13,"2024年8月19日总经理专题办公会议纪要","330700143944",{"$f":"VLOOKUP(C:C,'[1]2024B1-B6清单'!$A:$D,4,0)","v":"开关电源"},{"$f":"VLOOKUP(C:C,'[1]2024B1-B6清单'!$A:$E,5,0)","v":"开关电源"},{"$f":"VLOOKUP(C:C,'[1]2024B1-B6清单'!$A:$X,24,0)","v":14206.09},{"$f":"VLOOKUP(C:C,'[1]2024B1-B6清单'!$A:$Y,25,0)","v":13779.91},1,{"$f":"VLOOKUP(C:C,'[1]2024B1-B6清单'!$A:$Z,26,0)","v":426.18},"架",null,"组合式",null,{"$f":"VLOOKUP(C:C,'[1]2024B1-B6清单'!$A:$P,16,0)","v":"义乌福田中央公园西"},{"$f":"VLOOKUP(C:C,'[1]2024B1-B6清单'!$A:$Q,17,0)","v":"330782908000000937"},{"$f":"VLOOKUP(C:C,'[1]2024B1-B6清单'!$A:$C,3,0)","v":"义乌"},2024,"2024B6"]
[14,"2024年8月19日总经理专题办公会议纪要","330700319478",{"$f":"VLOOKUP(C:C,'[1]2024B1-B6清单'!$A:$D,4,0)","v":"开关电源"},{"$f":"VLOOKUP(C:C,'[1]2024B1-B6清单'!$A:$E,5,0)","v":"开关电源"},{"$f":"VLOOKUP(C:C,'[1]2024B1-B6清单'!$A:$X,24,0)","v":8898.26},{"$f":"VLOOKUP(C:C,'[1]2024B1-B6清单'!$A:$Y,25,0)","v":8631.31},1,{"$f":"VLOOKUP(C:C,'[1]2024B1-B6清单'!$A:$Z,26,0)","v":266.95},"架",null,"组合式",null,{"$f":"VLOOKUP(C:C,'[1]2024B1-B6清单'!$A:$P,16,0)","v":"义乌假日酒店"},{"$f":"VLOOKUP(C:C,'[1]2024B1-B6清单'!$A:$Q,17,0)","v":"33078200000447"},{"$f":"VLOOKUP(C:C,'[1]2024B1-B6清单'!$A:$C,3,0)","v":"义乌"},2024,"2024B6"]
[15,"2024年8月19日总经理专题办公会议纪要","330700130479",{"$f":"VLOOKUP(C:C,'[1]2024B1-B6清单'!$A:$D,4,0)","v":"开关电源"},{"$f":"VLOOKUP(C:C,'[1]2024B1-B6清单'!$A:$E,5,0)","v":"开关电源"},{"$f":"VLOOKUP(C:C,'[1]2024B1-B6清单'!$A:$X,24,0)","v":6854.69},{"$f":"VLOOKUP(C:C,'[1]2024B1-B6清单'!$A:$Y,25,0)","v":6649.05},1,{"$f":"VLOOKUP(C:C,'[1]2024B1-B6清单'!$A:$Z,26,0)","v":205.64},"架",null,"组合式",null,{"$f":"VLOOKUP(C:C,'[1]2024B1-B6清单'!$A:$P,16,0)","v":"义乌苏溪马丁-2"},{"$f":"VLOOKUP(C:C,'[1]2024B1-B6清单'!$A:$Q,17,0)","v":"330782908000002651"},{"$f":"VLOOKUP(C:C,'[1]2024B1-B6清单'!$A:$C,3,0)","v":"义乌"},2024,"2024B6"]
[16,"2024年8月19日总经理专题办公会议纪要","330700340481",{"$f":"VLOOKUP(C:C,'[1]2024B1-B6清单'!$A:$D,4,0)","v":"动力及环境监控单元"},{"$f":"VLOOKUP(C:C,'[1]2024B1-B6清单'!$A:$E,5,0)","v":"动环"},{"$f":"VLOOKUP(C:C,'[1]2024B1-B6清单'!$A:$X,24,0)","v":2937.63},{"$f":"VLOOKUP(C:C,'[1]2024B1-B6清单'!$A:$Y,25,0)","v":2849.5},1,{"$f":"VLOOKUP(C:C,'[1]2024B1-B6清单'!$A:$Z,26,0)","v":88.13},"个",null,"监控",null,{"$f":"VLOOKUP(C:C,'[1]2024B1-B6清单'!$A:$P,16,0)","v":"义乌江东金星"},{"$f":"VLOOKUP(C:C,'[1]2024B1-B6清单'!$A:$Q,17,0)","v":"330782700000111884"},{"$f":"VLOOKUP(C:C,'[1]2024B1-B6清单'!$A:$C,3,0)","v":"义乌"},2024,"2024B6"]
[17,"2024年8月19日总经理专题办公会议纪要","330700377090",{"$f":"VLOOKUP(C:C,'[1]2024B1-B6清单'!$A:$D,4,0)","v":"动力及环境监控单元"},{"$f":"VLOOKUP(C:C,'[1]2024B1-B6清单'!$A:$E,5,0)","v":"动环"},{"$f":"VLOOKUP(C:C,'[1]2024B1-B6清单'!$A:$X,24,0)","v":2671.62},{"$f":"VLOOKUP(C:C,'[1]2024B1-B6清单'!$A:$Y,25,0)","v":2123.54},1,{"$f":"VLOOKUP(C:C,'[1]2024B1-B6清单'!$A:$Z,26,0)","v":548.08},"个",null,"监控",null,{"$f":"VLOOKUP(C:C,'[1]2024B1-B6清单'!$A:$P,16,0)","v":"义乌平畴欧迅"},{"$f":"VLOOKUP(C:C,'[1]2024B1-B6清单'!$A:$Q,17,0)","v":"330782908000002522"},{"$f":"VLOOKUP(C:C,'[1]2024B1-B6清单'!$A:$C,3,0)","v":"义乌"},2024,"2024B6"]
[18,"2024年8月19日总经理专题办公会议纪要","330700323246",{"$f":"VLOOKUP(C:C,'[1]2024B1-B6清单'!$A:$D,4,0)","v":"动力及环境监控单元"},{"$f":"VLOOKUP(C:C,'[1]2024B1-B6清单'!$A:$E,5,0)","v":"动环"},{"$f":"VLOOKUP(C:C,'[1]2024B1-B6清单'!$A:$X,24,0)","v":3854.7},{"$f":"VLOOKUP(C:C,'[1]2024B1-B6清单'!$A:$Y,25,0)","v":3739.06},1,{"$f":"VLOOKUP(C:C,'[1]2024B1-B6清单'!$A:$Z,26,0)","v":115.64},"个",null,"监控",null,{"$f":"VLOOKUP(C:C,'[1]2024B1-B6清单'!$A:$P,16,0)","v":"义乌山口二北"},{"$f":"VLOOKUP(C:C,'[1]2024B1-B6清单'!$A:$Q,17,0)","v":"330782010000000743"},{"$f":"VLOOKUP(C:C,'[1]2024B1-B6清单'!$A:$C,3,0)","v":"义乌"},2024,"2024B6"]
[19,"2024年8月19日总经理专题办公会议纪要","330700382118",{"$f":"VLOOKUP(C:C,'[1]2024B1-B6清单'!$A:$D,4,0)","v":"动力及环境监控单元"},{"$f":"VLOOKUP(C:C,'[1]2024B1-B6清单'!$A:$E,5,0)","v":"动环"},{"$f":"VLOOKUP(C:C,'[1]2024B1-B6清单'!$A:$X,24,0)","v":2661.8},{"$f":"VLOOKUP(C:C,'[1]2024B1-B6清单'!$A:$Y,25,0)","v":2079.88},1,{"$f":"VLOOKUP(C:C,'[1]2024B1-B6清单'!$A:$Z,26,0)","v":581.92},"个",null,"监控",null,{"$f":"VLOOKUP(C:C,'[1]2024B1-B6清单'!$A:$P,16,0)","v":"义乌苏溪颜村"},{"$f":"VLOOKUP(C:C,'[1]2024B1-B6清单'!$A:$Q,17,0)","v":"330782908000000901"},{"$f":"VLOOKUP(C:C,'[1]2024B1-B6清单'!$A:$C,3,0)","v":"义乌"},2024,"2024B6"]
{"$rows_left_out":76}
{"sheet":"嘉兴","index":3,"n_rows":78,"n_cols":16,"rows_kept":78}
["序号","报废批复文号","资产编号","资产名称","资产原值\n（元，不含税）","资产净值\n（元，不含税）","累计折旧","资产数量","计量单位\n（个/吨/米等）","单节电池电压（2V/12V）","规格型号","生产厂家","站点名称","站点编码","批号","备注"]
[1,"嘉兴铁塔党委会纪要〔2024〕第12期","330400341372","交流配电箱",2710.8,117.91,2592.89,1,"个","/","不详","省邮电","海宁江南世家34幢","330481500000001859","省邮电*不详*交流配电箱*海宁江南世家34幢*330481500000001859**330400341372*整治*废旧"]
[2,"嘉兴铁塔党委会纪要〔2024〕第12期","330400112571","交流配电柜",13806.53,414.2,13392.33,1,"个","/","不详","浙江宝气","海宁飞浪仪表厂","330481908000000887","浙江宝气*不详*交流配电箱*海宁飞浪仪表厂*330481908000000887**330400112571*整治*废旧"]
[3,"嘉兴铁塔党委会纪要〔2024〕第12期","330400356546","交流配电箱",1898.27,517.3,1380.97,1,"个","/","DPJ01-800x600x250","通鼎宽带","海宁荷叶村海新桥","330481500000002002","通鼎宽带*DPJ01-800x600x250*交流配电箱*海宁荷叶村海新桥*330481500000002002**330400356546*拆站*废旧"]
[4,"嘉兴铁塔党委会纪要〔2024〕第12期","330400316600","壁挂式开关电源",9965.35,298.96,9666.39,1,"架","/","63A/2Px1","无","平湖伊思佳企业","33048201000032","无*63A/2Px1*壁挂式开关电源*平湖伊思佳企业*33048201000032**330400316600*拆站*利旧"]
[5,"嘉兴铁塔党委会纪要〔2024〕第12期","330400360035","普通空调柜式",3659.14,1144.96,2514.18,1,"台","/","KFR-75W/15S 3匹","华凌","桐乡电力营业厅-2","330483908000000226","华凌*KFR-75W/15S 3匹*空调*桐乡电力营业厅-2*330483908000000226**330400360035**废旧"]
[6,"嘉兴铁塔党委会纪要〔2024〕第12期","3304005400","普通空调机",6583.88,197.52,6386.36,1,"台","/","KF-72LW/SN-JZ1(R2)（3P带铜管）*","广东美的","桐乡义马-3","330483908000000465","广东美的*普通空调*KF-72LW/SN-JZ1(R2)（3P带铜管）*桐乡义马-3*330483908000000465**3304005400*置换*废旧"]
[7,"嘉兴铁塔党委会纪要〔2024〕第12期","3304005209","专用空调",462.43,13.87,448.56,1,"台","/","KF-72LW/TSUS-N2（3P带铜管）","海信","桐乡崇福老芝村南浜","33048301000523","海信*专用空调*KF-72LW/TSUS-N2（3P带铜管）*桐乡崇福老芝村南浜*33048301000523**3304005209*置换*废旧"]
[8,"嘉兴铁塔党委会纪要〔2024〕第12期","3304006963","通用空调",7978.47,239.35,7739.12,1,"台","/","KF-75LW/SUTK-N23匹","广东科龙","平湖花园工业区","330482908000000701","广东科龙*KF-75LW/SUTK-N23匹*普通空调*平湖花园工业区*330482908000000701**3304006963*拆站*废旧"]
[9,"嘉兴铁塔党委会纪要〔2024〕第12期","330400328546","普通空调柜式",6958.35,208.75,6749.6,1,"台","/","KF-72LW/S-JZ1(D2)3匹","美的","平湖全塘勤益塑料","330482908000000091","美的*KF-72LW/S-JZ1(D2)3匹*普通空调*平湖全塘勤益塑料*330482908000000091**330400328546*拆站*废旧"]
[10,"嘉兴铁塔党委会纪要〔2024〕第12期","330400116463","普通空调-松下",892.5,26.78,865.72,1,"台","/","KF-73LW/19Y23匹","松下","平湖大润发超市","330482908000000519","松下*KF-73LW/19Y23匹*普通空调*平湖大润发超市*330482908000000519**330400116463*拆站*废旧"]
[11,"嘉兴铁塔党委会纪要〔2024〕第12期","330400315467","普通空调柜式",6460.54,193.82,6266.72,1,"台","/","KF-72L/TSUS-N2（3p带铜管）","海信","桐乡恒兴艺饰公司-2","330483908000000222","海信*KF-72L/TSUS-N2（3p带铜管）*普通空调柜式*桐乡恒兴艺饰公司-2*330483908000000222**330400315467*拆站*废旧"]
[12,"嘉兴铁塔党委会纪要〔2024〕第10期","330400312330","普通空调柜式",6168.99,185.07,5983.92,1,"台","/","KF-72LW/S-JZ1(D2)3P含铜管","美的","海盐吕冢","330424908000000407","美的*KF-72LW/S-JZ1(D2)3P含铜管*空调*海盐吕冢*330424908000000407**330400312330*拆站*废旧"]
[13,"嘉兴铁塔党委会纪要〔2024〕第10期","330400133616","专用空调",201,6.03,194.97,1,"台","/","KF-72LW/HV10S(5)3P含铜管","华菱","海盐元通老街","330424908000000121","华菱*KF-72LW/HV10S(5)3P含铜管*空调*海盐元通老街*330424908000000121**330400133616*拆站*废旧"]
[14,"嘉兴铁塔党委会纪要〔2024〕第10期","330400107545","专用空调",4158,124.74,4033.26,1,"台","/","KF-120LW/35T(02)5P含铜管","海信","海盐秦山方家山","330424908000000299","海信*KF-120LW/35T(02)5P含铜管*空调*海盐秦山方家山*330424908000000299**330400107545*拆站*废旧"]
[15,"嘉兴铁塔党委会纪要〔2024〕第10期","330400107546","专用空调",1335.52,40.07,1295.45,1,"台","/","KF-72LW/TSUS-N23P含铜管","海信","海盐秦山方家山","330424908000000299","海信*KF-72LW/TSUS-N23P含铜管*空调*海盐秦山方家山*330424908000000299**330400107546*拆站*废旧"]
[16,"嘉兴铁塔党委会纪要〔2024〕第12期","330400115443","专用空调",201,6.03,194.97,1,"台","/","KF-72LW-HV10S(5)3P含铜管","华凌","海盐高竹工业区","330424908000000104","华凌*KF-72LW-HV10S(5)3P含铜管*空调*海盐高竹工业区*330424908000000104**330400115443*拆站*废旧"]
[17,"嘉兴铁塔党委会纪要〔2024〕第12期","330400116532","通用空调-通用空调",103,3.09,99.91,1,"台","/","KF-72LW/TSUS-N23P含铜管","海信","海盐楞子港","33042401000308","海信*KF-72LW/TSUS-N23P含铜管*空调*海盐楞子港*33042401000308**330400116532*拆站*废旧"]
[18,"嘉兴铁塔党委会纪要〔2024〕第12期","330400115486","专用空调",4328.24,129.85,4198.39,1,"台","/","KF-75LW/SUT-N23P含铜管","海信","海盐国防训练中心","330424908000000118","海信*KF-75LW/SUT-N23P含铜管*空调*海盐国防训练中心*330424908000000118**330400115486*拆站*废旧"]
[19,"嘉兴铁塔党委会纪要〔2024〕第12期","330400115102","专用空调",5825.33,174.76,5650.57,1,"台","/","KF-72LW-TSUS-N23P含铜管","海信","海盐驾校报名处（铁塔）","330424500000000085","海信*KF-72LW-TSUS-N23P含铜管*空调*海盐驾校报名处（铁塔）*330424500000000085**330400115102*拆站*废旧"]
{"$rows_left_out":59}
{"sheet":"杭州","index":4,"n_rows":213,"n_cols":25,"rows_kept":213}
["序号","报废批复文号","资产编号","资产名称","资产类别名称","资产原值\n（元，不含税）","资产净值\n（元，不含税）","累计折旧","资产数量","计量单位","单节电池电压","规格型号","生产厂家","站点名称","站点编码","备注","中通库K3编号","报废批复文号（省公司）","对应估值清单的分类描述(人工调整资产名称）","资产类别名称","物资称重（kg)","完整度/出铜（铝）率","计量方式","计量单位"]
[1,"杭州市分公司2023年第三次党委会纪要-杭州铁塔党委会纪要〔2023〕第3期","330100317969","传感器","传感器",556.21,461.71,94.5,1,"个",null,"霍尔传感器","无","杭州宏利石材","330104908000000607","","无*霍尔传感器**杭州宏利石材*330104908000000607*0.264kg*330100317969*批*废旧","","传感器","传感器",0.264,null,"称重计量后套用价格","个"]
[2,"杭州市分公司2023年第三次党委会纪要-杭州铁塔党委会纪要〔2023〕第3期","330100208364","传感器","传感器",2417.16,235.33,2181.83,1,"个",null,"监控传感器","无","杭州康桥焊接基站","330105908000000416","","无*监控传感器**杭州康桥焊接基站*330105908000000416*1kg*330100208364*批*废旧","","传感器","传感器",{"v":1,"d":"1.000"},null,"称重计量后套用价格","个"]
[3,"杭州市分公司2023年第三次党委会纪要-杭州铁塔党委会纪要〔2023〕第3期","330100301968","电表","电表",966,747.32,218.68,1,"个",null,"智能电表","无","杭州下沙斯莱特泵业","330104906000014161","","无*智能电表**杭州下沙斯莱特泵业*330104906000014161*1.5kg*330100301968*批*废旧","","电表","电表",{"v":1.5,"d":"1.500"},null,"称重计量后套用价格","个"]
[4,"杭州市分公司2023年第三次党委会纪要-杭州铁塔党委会纪要〔2023〕第3期","330100301969","电表","电表",966,747.32,218.68,1,"个",null,"智能电表","无","下沙斯莱特泵业","330104908000001376","","无*智能电表**下沙斯莱特泵业*330104908000001376*1.5kg*330100301969*批*废旧","","电表","电表",{"v":1.5,"d":"1.500"},null,"称重计量后套用价格","个"]
[5,null,"配件","电池架","电池架",{"$nulls":3},266.5,"千克",null,"电池架","无","十方-萧山","无","","无*电池架**十方-萧山*无*266.5kg*330100234867等17个资产配件*批*废旧",null,"电池架","电池架",{"v":266.5,"d":"266.500"},null,"称重计量后套用价格","千克"]
[6,null,"配件","电池架","电池架",{"$nulls":3},492,"千克",null,"电池架","无","方大-西湖余杭","无","","无*电池架**方大-西湖余杭*无*492kg*330100223994等24个资产配件*批*废旧",null,"电池架","电池架",{"v":492,"d":"492.000"},null,"称重计量后套用价格","千克"]
[7,null,"配件","电池架","电池架",{"$nulls":3},187.5,"千克",null,"电池架","无","十方-拱墅钱塘","无","","无*电池架**十方-拱墅钱塘*无*187.5kg*330100179945等9个资产配件*批*废旧",null,"电池架","电池架",{"v":187.5,"d":"187.500"},null,"称重计量后套用价格","千克"]
[8,null,"配件","电池架","电池架",{"$nulls":3},213,"千克",null,"电池架","无","十方-上城","无","","无*电池架**十方-上城*无*213kg*330100137845等18个资产配件*批*废旧",null,"电池架","电池架",{"v":213,"d":"213.000"},null,"称重计量后套用价格","千克"]
[9,null,"配件","电池架","电池架",{"$nulls":3},1071.5,"千克",null,"电池架","无","十方-萧山配件","无","","无*电池架**十方-萧山配件*无*1071.5kg*330100209688等41个资产配件*批*废旧",null,"电池架","电池架",{"v":1071.5,"d":"1071.500"},null,"称重计量后套用价格","千克"]
[10,null,"配件","电池架","电池架",{"$nulls":3},335.5,"千克",null,"电池架","无","依网-淳安","无","","无*电池架**依网-淳安*无*335.5kg*330100161701等17个资产配件*批*废旧",null,"电池架","电池架",{"v":335.5,"d":"335.500"},null,"称重计量后套用价格","千克"]
[11,null,"配件","电池架","电池架",{"$nulls":3},421.5,"千克",null,"电池架","无","依网-建德","无","","无*电池架**依网-建德*无*421.5kg*330100168032等12个资产配件*批*废旧",null,"电池架","电池架",{"v":421.5,"d":"421.500"},null,"称重计量后套用价格","千克"]
[12,"杭州市分公司2024年第四次党委会纪要-杭州铁塔党委会纪要(2024)第6期","330100321773","电缆","电缆",9202.42,6825.03,2377.39,6,"千克",null,"铝缆-4芯","无","杭州蓝孔雀宾馆","330105908000000445","出铝率40%","无*铝缆-4芯*出铝率40%*杭州蓝孔雀宾馆*330105908000000445*6kg*330100321773*批*废旧","","铝缆","铝缆类",{"v":6,"d":"6.000"},"出铝率40%","称重及出铝率计量后套用价格","千克"]
[13,"杭州市分公司2024年第二十六次党委会纪要-杭州铁塔党委会纪要(2024)第28期","330100132460","电缆","电缆",2402.06,363.28,2038.78,5.3,"千克",null,"铝缆-4芯","无","杭州东篱会所","330102908000000138","出铝率40%","无*铝缆-4芯*出铝率40%*杭州东篱会所*330102908000000138*5.3kg*330100132460*批*废旧","","铝缆","铝缆类",{"v":5.3,"d":"5.300"},"出铝率40%","称重及出铝率计量后套用价格","千克"]
[14,"杭州市分公司2024年第二十六次党委会纪要-杭州铁塔党委会纪要(2024)第28期","330100425104","电缆","电缆",39904.15,35236.37,4667.78,5.3,"千克",null,"铝缆-4芯","无","杭州东篱会所","330102908000000138","出铝率40%","无*铝缆-4芯*出铝率40%*杭州东篱会所*330102908000000138*5.3kg*330100425104*批*废旧","","铝缆","铝缆类",{"v":5.3,"d":"5.300"},"出铝率40%","称重及出铝率计量后套用价格","千克"]
[15,"杭州市分公司2024年第二十六次党委会纪要-杭州铁塔党委会纪要(2024)第28期","330100418433","电缆","电缆",2994.2,2595,399.2,5.4,"千克",null,"铝缆-4芯","无","杭州横塘村十组","330103908000000376","出铝率40%","无*铝缆-4芯*出铝率40%*杭州横塘村十组*330103908000000376*5.4kg*330100418433*批*废旧","","铝缆","铝缆类",{"v":5.4,"d":"5.400"},"出铝率40%","称重及出铝率计量后套用价格","千克"]
[16,"杭州市分公司2023年第二十二次党委会纪要-杭州铁塔党委会纪要〔2023〕第22期","330100141864","电缆","电缆",5887.77,1509.29,4378.48,2,"千克",null,"铜缆-1芯","无","杭州优派制衣","330105908000000138","出铜率22.5%","无*铜缆-1芯*出铜率22.5%*杭州优派制衣*330105908000000138*2kg*330100141864*批*废旧","","铜缆","铜缆类",{"v":2,"d":"2.000"},"出铜率22.5%","称重及出铜率计量后套用价格","千克"]
[17,"杭州市分公司2024年第四次党委会纪要-杭州铁塔党委会纪要(2024)第6期","330100110524","电缆","电缆",1659.92,358.34,1301.58,1.5,"千克",null,"铜缆-1芯","无","萧山荣星村","330109908000000806","出铜率22.5%","无*铜缆-1芯*出铜率22.5%*萧山荣星村*330109908000000806*1.5kg*330100110524*批*废旧","","铜缆","铜缆类",{"v":1.5,"d":"1.500"},"出铜率22.5%","称重及出铜率计量后套用价格","千克"]
[18,"杭州市分公司2023年第三次党委会纪要-杭州铁塔党委会纪要〔2023〕第3期","330100260154","断路器","断路器",1095,601.77,493.23,1,"个",null,"","无","金一社区搬迁","330109500000000784","","无***金一社区搬迁*330109500000000784*0.098kg*330100260154*批*废旧","","断路器","断路器",0.098,null,"称重计量后套用价格","个"]
[19,"杭州市分公司2023年第三次党委会纪要-杭州铁塔党委会纪要〔2023〕第3期","330100283411","断路器","断路器",4180.93,2350.69,1830.24,1,"个",null,"","无","七间头","330109500000000388","","无***七间头*330109500000000388*0.098kg*330100283411*批*废旧","","断路器","断路器",0.098,null,"称重计量后套用价格","个"]
{"$rows_left_out":193}