{"text_format":"3","workbook":"xlsx","n_sheets":7,"sheets":["地市透视表","汇总","金华","宁波","衢州","湖州","温州"],"not_rendered":{"images":5,"external_links":3,"defined_names":4},"read":"whole","date_system":"1900"}

{"sheet":"地市透视表","index":0,"n_rows":7,"n_cols":6,"rows_kept":7,"merged":[[0,11,0,15]]}
["地市","资产条数","资产原值（元）","资产净值（元）","净值/原值","评估价（元）"]
["金华",241,599145.02,51978.53,{"$f":"D2/C2","v":{"v":0.0867545056120136,"d":"8.68%"}},{"v":60254.224,"d":"60254.22"}]
["宁波",164,565556.56,27638.52,{"v":0.0488695949349434,"d":"4.89%"},51372.41]
["衢州",23,109978.61,3299.34,{"v":0.0299998336040072,"d":"3.00%"},{"v":1501,"d":"1501.00"}]
["湖州",62,274868.55,41004.08,{"v":0.149177052085442,"d":"14.92%"},27098.03]
["温州",183,151892.73,8868.52,{"v":0.0583867312148514,"d":"5.84%"},{"v":3261.719,"d":"3261.72"}]
["合计",{"$f":"SUM(B2:B6)","v":673},{"$f":"SUM(C2:C6)","v":1701441.47},{"$f":"SUM(D2:D6)","v":132788.99},{"v":0.0780449944011297,"d":"7.80%"},{"$f":"SUM(F2:F6)","v":{"v":143487.383,"d":"143487.38"}}]

{"sheet":"汇总","index":1,"n_rows":78,"n_cols":11,"rows_kept":78,"merged":[[5,4,6,4],[5,5,6,5],[23,6,25,6],[23,9,25,9],[38,6,50,6],[38,9,50,9]]}
["地市","拍卖批次","资产类别名称（大类相同完整度不同的分行填报）","对应估值清单的分类描述","计量单位","资产数量","总重量（kg）","完整度/出铜（铝）率（%）","最低转让单价（含税）","最低转让总价（含税）","备注\n（主要配件缺失的需要注明）"]
["金华","第二十七批","3P空调","3匹室内外成套","套",29,"/","/",936,{"$f":"I2*F2","v":{"v":27144,"d":"27144.00"}},"铜管"]
["金华","第二十七批","壁挂空调","2P及2P以下成套空调","套",10,"/","/",520,{"$f":"I3*F3","v":{"v":5200,"d":"5200.00"}},"铜管"]
["金华","第二十七批","壁挂式开关电源","其他各类铁质为主的报废物资","个",2,40,"/","2270元/吨",{"$f":"2270/1000*G4","v":90.8},"模块"]
["金华","第二十七批","电表箱","配电箱类","个",1,0.5,"/",107,{"v":107,"d":"107.00"}]
["金华","第二十七批","电线电缆","铝缆类","根",74,29.5,{"v":0.5,"d":"50%"},"17090元/吨×出铝率",{"$f":"17090/1000*H6*G6","v":{"v":252.0775,"d":"252.08"}}]
["金华","第二十七批","电线电缆","铜缆类",null,null,231,{"v":0.5,"d":"50%"},"70510元/吨×出铜率",{"$f":"70510/1000*H7*G7","v":{"v":8143.905,"d":"8143.91"}}]
["金华","第二十七批","动环监控","动环监控","个",20,70,"/",16,{"v":320,"d":"320.00"}]
["金华","第二十七批","霍尔传感器","其他各类铁质为主的报废物资","个",1,0.3,"/","2270元/吨",{"$f":"2270/1000*G9","v":0.681}]
["金华","第二十七批","交流配电箱","配电箱类","个",2,40,"/",107,{"$f":"I10*F10","v":{"v":214,"d":"214.00"}}]
["金华","第二十七批","接地汇流牌","其他各类铁质为主的报废物资","个",30,53,"/","2270元/吨",120.31]
["金华","第二十七批","接地汇流条","其他各类铁质为主的报废物资","根",14,36.5,"/","2270元/吨",82.855]
["金华","第二十七批","空调控制器","其他各类铁质为主的报废物资","个",2,2,"/","2270元/吨",4.54]
["金华","第二十七批","馈线","铜缆类","米",21,4.5,{"v":0.2,"d":"20%"},"70510元/吨×出铜率",{"$f":"70510/1000*H14*G14","v":{"v":63.459,"d":"63.46"}}]
["金华","第二十七批","门禁","其他各类铁质为主的报废物资","个",1,0.25,"/","2270元/吨",{"$f":"2270/1000*G15","v":0.5675}]
["金华","第二十七批","模块","其他各类铁质为主的报废物资","个",13,19.5,"/","2270元/吨",44.265]
["金华","第二十七批","嵌入式开关电源","其他各类铁质为主的报废物资","个",22,517,"/","2270元/吨",1173.59,"模块"]
["金华","第二十七批","熔断器","其他各类铁质为主的报废物资","个",2,0.8,"/","2270元/吨",1.816]
["金华","第二十七批","熔丝","其他各类铁质为主的报废物资","个",2,0.4,"/","2270元/吨",0.908]
["金华","第二十七批","油机转换箱","配电箱类","个",1,2.5,"/",107,{"$f":"I20*F20","v":{"v":107,"d":"107.00"}}]
{"$rows_left_out":59}
{"sheet":"金华","index":2,"n_rows":242,"n_cols":18,"rows_kept":242}
["序号","报废批复文号","资产编号","资产名称","资产类别名称","资产原值\n（元，不含税）","资产净值\n（元，不含税）","累计折旧","资产数量","计量单位\n（个/吨/米等）","单节电池电压（2V/12V）","规格型号","生产厂家","站点名称","站点编码","县市","年份","报废批次"]
[1,"2023年金华分公司第11次党委会会议纪要(金华铁塔党委会纪要〔2023〕第13期)","330700318970",{"$f":"VLOOKUP(C:C,'[1]2024B1-B5清单'!$A:$D,4,0)","v":"动环监控设备"},"动环监控",3835.9,115.08,3720.82,1,"个",null,"监控",null,"武义下杨二村","33072300000203","武义",2024,"2024B3"]
[2,"2024年8月19日总经理专题办公会议纪要","330700451730",{"$f":"VLOOKUP(C:C,'[1]2024B1-B5清单'!$A:$D,4,0)","v":"外市电引入"},"电线电缆",4811,3880.7,930.3,1,"根",null,"4x35方10米铝/根",null,"义乌商贸城医院","33078200000156","义乌",2024,"2024B6"]
[3,"2024 年金华分公司第24次党委会会议纪要（金华铁塔党委会纪要〔2024〕第26期）","330700356199",{"$f":"VLOOKUP(C:C,'[1]2024B1-B5清单'!$A:$D,4,0)","v":"机房配套扩容资产"},"门禁",288,16.4,271.6,1,"个",null,"门禁配套物资电源转换模块",null,"义乌商贸城医院","33078200000156","义乌",2024,"2024B5"]
[4,"2024 年金华分公司第24次党委会会议纪要（金华铁塔党委会纪要〔2024〕第26期）","330700413086",{"$f":"VLOOKUP(C:C,'[1]2024B1-B5清单'!$A:$D,4,0)","v":"基站机房扩容资产"},"接地汇流牌",205.38,177.65,27.73,1,"段",null,"室外接地汇流排20孔",null,"义乌商贸城医院","33078200000156","义乌",2024,"2024B5"]
[5,"2024年8月19日总经理专题办公会议纪要","330700494410",{"$f":"VLOOKUP(C:C,'[1]2024B1-B5清单'!$A:$D,4,0)","v":"基站机房扩容资产"},"熔丝",125.82,117.19,8.63,1,"个",null,"熔丝",null,"义乌商贸城医院","33078200000156","义乌",2024,"2024B6"]
[6,"2024年8月19日总经理专题办公会议纪要","330700339694",{"$f":"VLOOKUP(C:C,'[1]2024B1-B5清单'!$A:$D,4,0)","v":"动力及环境监控单元"},"动环监控",2811.79,84.35,2727.44,1,"个",null,"监控",null,"东阳水口村","330783908000001421","东阳",2024,"2024B6"]
[7,"2024年8月19日总经理专题办公会议纪要","330700427407",{"$f":"VLOOKUP(C:C,'[1]2024B1-B5清单'!$A:$D,4,0)","v":"基站机房扩容资产"},"电线电缆",175.12,152.24,22.88,1,"根",null,"25方1米/根",null,"永康城西工业区楼塘","330784908000001391","永康",2024,"2024B6"]
[8,"2024年8月19日总经理专题办公会议纪要","330700393943",{"$f":"VLOOKUP(C:C,'[1]2024B1-B5清单'!$A:$D,4,0)","v":"基站机房扩容资产"},"电线电缆",518.63,438,80.63,1,"根",null,"50方0.5米/根",null,"永康城西工业区楼塘","330784908000001391","永康",2024,"2024B6"]
[9,"2024年8月19日总经理专题办公会议纪要","330700155235",{"$f":"VLOOKUP(C:C,'[1]2024B1-B5清单'!$A:$D,4,0)","v":"交流配电箱"},"交流配电箱",2273.43,68.2,2205.23,1,"个",null,"交流配电箱",null,"永康城西工业区楼塘","330784908000001391","永康",2024,"2024B6"]
[10,"2024年8月19日总经理专题办公会议纪要","330700155822",{"$f":"VLOOKUP(C:C,'[1]2024B1-B5清单'!$A:$D,4,0)","v":"油机转换箱"},"油机转换箱",753.25,22.6,730.65,1,"个",null,"油机转换箱",null,"永康城西工业区楼塘","330784908000001391","永康",2024,"2024B6"]
[11,"2024年8月19日总经理专题办公会议纪要","330700362920",{"$f":"VLOOKUP(C:C,'[1]2024B1-B5清单'!$A:$D,4,0)","v":"电源扩容资产"},"电表箱",628.97,69.72,559.25,1,"个",null,"通用配件电表箱",null,"永康城西工业区楼塘","330784908000001391","永康",2024,"2024B6"]
[12,"2024年8月19日总经理专题办公会议纪要","330700362412",{"$f":"VLOOKUP(C:C,'[1]2024B1-B5清单'!$A:$D,4,0)","v":"机房配套扩容资产"},"空调控制器",321.56,35.66,285.9,1,"个",null,"智能空调控制器",null,"永康城西工业区楼塘","330784908000001391","永康",2024,"2024B6"]
[13,"2024年8月19日总经理专题办公会议纪要","330700370042",{"$f":"VLOOKUP(C:C,'[1]2024B1-B5清单'!$A:$D,4,0)","v":"机房配套扩容资产"},"空调控制器",324.29,57.74,266.55,1,"个",null,"智能空调控制器",null,"永康城西工业区楼塘","330784908000001391","永康",2024,"2024B6"]
[14,"2024年8月19日总经理专题办公会议纪要","330700364538",{"$f":"VLOOKUP(C:C,'[1]2024B1-B5清单'!$A:$D,4,0)","v":"电力引入扩容资产"},"霍尔传感器",379.13,176.88,202.25,1,"个",null,"霍尔传感器电流型输入100A",null,"永康城西工业区楼塘","330784908000001391","永康",2024,"2024B6"]
[15,"2023年金华分公司第11次党委会会议纪要(金华铁塔党委会纪要〔2023〕第13期)","330700404346",{"$f":"VLOOKUP(C:C,'[1]2024B1-B5清单'!$A:$D,4,0)","v":"外市电引入"},"电线电缆",33985.92,25502.85,8483.07,1,"根",null,"4x25方4米/根",null,"义乌渡馨北路搬迁","330782500000002126","义乌",2024,"2023B3"]
[16,"2024年8月19日总经理专题办公会议纪要","330700141889",{"$f":"VLOOKUP(C:C,'[1]2024B1-B5清单'!$A:$D,4,0)","v":"1KV以下电力电缆"},"电线电缆",675.25,96.63,578.62,1,"根",null,"2x6方8米/根",null,"武义西联/马口","330723908000000089","武义",2024,"2024B6"]
[17,"2024年8月19日总经理专题办公会议纪要","330700301039",{"$f":"VLOOKUP(C:C,'[1]2024B1-B5清单'!$A:$D,4,0)","v":"交流配电箱"},"交流配电箱",5005.84,150.18,4855.66,1,"个",null,"交流配电箱",null,"武义西联/马口","330723908000000089","武义",2024,"2024B6"]
[18,"2024年8月19日总经理专题办公会议纪要","330700103095",{"$f":"VLOOKUP(C:C,'[1]2024B1-B5清单'!$A:$D,4,0)","v":"开关电源"},"组合式开关电源",3685.46,110.56,3574.9,1,"架",null,"组合式",null,"武义西联/马口","330723908000000089","武义",2024,"2024B6"]
[19,"2024年8月19日总经理专题办公会议纪要","330700448643",{"$f":"VLOOKUP(C:C,'[1]2024B1-B5清单'!$A:$D,4,0)","v":"电源扩容资产"},"熔丝",289.06,203.91,85.15,1,"个",null,"熔丝",null,"马口","330723908000000089","武义",2024,"2024B6"]
{"$rows_left_out":223}
{"sheet":"宁波","index":3,"n_rows":165,"n_cols":16,"rows_kept":165}
["序号","报废批复文号","资产编号","批次","资产名称","资产类别名称","资产原值","资产净值","累计折旧","资产数量","计量单位\n（个/吨/米等）","单节电池电压（2V/12V）","规格型号","生产厂家","站点名称","站点编码"]
[1,"宁波铁塔党委会纪要〔2022〕第 21 期","330200325006",null,"嵌入式开关电源32A/3P*1（室外标准机柜用）","嵌入式开关电源",9756.93,292.71,9464.22,1,"架",null,"ETP48200",{"$f":"VLOOKUP(C2,'[3]00资产已报废'!$B:$P,13,0)","v":"中达电通股份有限公司"},null,"330283500000000100"]
[2,"宁波铁塔总经理办公会纪要〔2023〕第 66 期","330200323542",null,"嵌入式开关电源32A/3P*1（室外标准机柜用）","组合式开关电源",3728.85,111.87,3616.98,1,"架",null,"(杭州中恒)-开关电源及电源模块-开关电源",{"$f":"VLOOKUP(C3,'[3]00资产已报废'!$B:$P,13,0)","v":"杭州中恒电气股份有限公司"},null,"330282908000001357"]
[3,"宁波铁塔总经理办公会纪要〔2023〕第 66 期","330200342274",null,"(中达电通)-开关电源及电源模块-开关电源","嵌入式开关电源",5401.49,162.04,5239.45,1,"架",null,"嵌入式开关电源32A/3P*1（室外标准机柜用）",{"$f":"VLOOKUP(C4,'[3]00资产已报废'!$B:$P,13,0)","v":"中达电通股份有限公司"},null,"330225500000000051"]
[4,"宁波铁塔总经理办公会纪要〔2023〕第 66 期","330200333118",null,"嵌入式开关电源","嵌入式开关电源",7535.76,226.07,7309.69,1,"架",null,"48V/300A高效系统(50A高效模块，共用电源系统，三相交流输入)100A",null,null,"330206500000000179"]
[5,"宁波铁塔总经理办公会纪要〔2023〕第 66 期","330200342275",null,"(杭州中恒)-开关电源及电源模块-开关电源","嵌入式开关电源",5442.39,163.27,5279.12,1,"架",null,"嵌入式开关电源32A/3P*1（室外标准机柜用）",{"$f":"VLOOKUP(C6,'[3]00资产已报废'!$B:$P,13,0)","v":"杭州中恒电气股份有限公司"},null,"330225500000000051"]
[6,"宁波铁塔总经理办公会纪要〔2023〕第 66 期","330200320887",null,"嵌入式开关电源","嵌入式开关电源",5826.94,174.81,5652.13,1,"架",null,"嵌入式开关电源32A/3P*1（室外标准机柜用）",{"$f":"VLOOKUP(C7,'[3]00资产已报废'!$B:$P,13,0)","v":"中达电通股份有限公司"},null,"330206500000000009"]
[7,"宁波铁塔总经理办公会纪要〔2023〕第 66 期","330200334704",null,"嵌入式开关电源","嵌入式开关电源",5929.29,177.88,5751.41,1,"架",null,"48V/300A高效系统(50A高效模块，共用电源系统，三相交流输入)100A",null,null,"330225908000000494"]
[8,"宁波铁塔总经理办公会纪要〔2023〕第 66 期","330200010927",null,"(杭州中恒)-开关电源及电源模块-开关电源","组合式开关电源",10849.77,325.49,10524.28,1,"架",null,"壁挂式开关电源32A/3P*1",{"$f":"VLOOKUP(C9,'[3]00资产已报废'!$B:$P,13,0)","v":"杭州中恒电气股份有限公司"},null,"330212908000001518"]
[9,"宁波铁塔总经理办公会纪要〔2023〕第 66 期","330200338089",null,"嵌入式开关电源","嵌入式开关电源",5605.71,168.17,5437.54,1,"架",null,"48V/300A高效系统(50A高效模块，共用电源系统，三相交流输入)100A",null,null,"330282908000001100"]
[10,"总经理办公会纪要〔2024〕第 3 期","330200330603",null,"(北京融和创)-空调及空调零部件-空调","基站空调柜式",6241.11,187.23,6053.88,1,"台",null,"3P 三相柜式（单冷）",{"$f":"VLOOKUP(C11,'[3]00资产已报废'!$B:$P,13,0)","v":"北京融和创科技有限公司"},null,"330212010000001315"]
[11,"总经理办公会纪要〔2024〕第 3 期","330200341617",null,"(杭州中恒)-开关电源及电源模块-开关电源","壁挂式开关电源",5037.09,151.11,4885.98,1,"架",null,"壁挂式开关电源32A/3P*1",{"$f":"VLOOKUP(C12,'[3]00资产已报废'!$B:$P,13,0)","v":"杭州中恒电气股份有限公司"},null,"33021101000099"]
[12,"总经理办公会纪要〔2024〕第7期","330200343011",null,"(杭州中恒)-开关电源及电源模块-开关电源模块","整流模块",7098.55,212.96,6885.59,1,"个",null,"50A（普效模块）",{"$f":"VLOOKUP(C13,'[3]00资产已报废'!$B:$P,13,0)","v":"杭州中恒电气股份有限公司"},null,"330212908000001805"]
[13,"宁波铁塔党委会纪要〔2018〕第5期","330200150558",null,"通用空调-通用空调","基站空调柜式",103,3.09,99.91,1,"台",null,"FVY71LQVLB","上海大金",null,"330205908000000188"]
[14,"宁波铁塔党委会纪要〔2018〕第25期","330200151671",null,"实验小学X0103分体","基站空调柜式",312,9.36,302.64,1,"台",null,"LF72W-LCSJA","上海三菱电机",null,"330281908000001543"]
[15,"宁波铁塔党委会纪要〔2018〕第25期","330200303279",null,"空调","基站空调柜式",103,54.35,48.65,1,"台",null,"空调","无",null,"330204908000000085"]
[16,"宁波铁塔党委会纪要〔2018〕第25期","330200304926",null,"空调","基站空调柜式",493.71,260.96,232.75,1,"台",null,"空调","无",null,"330212500000000170"]
[17,"宁波铁塔党委会纪要〔2020〕第31期","330200308712",null,"开关电源","组合开关电源柜",21057.15,3468.56,17588.59,1,"个",null,"开关电源配套设备--壁挂式开关电源系统---48V","中恒",null,"330282908000001042"]
[18,"总经理办公会纪要〔2024〕第7期","330200360909",null,"动力及环境监控单元","动力及环境监控单元",2794.87,159.16,2635.71,1,"个",null,"主设备室内型成套设备基本配置模型",null,null,"330281500000000254"]
[19,"总经理办公会纪要〔2024〕第 44 期","330200100830",null,"通用空调-通用空调","基站空调柜式",206,6.18,199.82,1,"台",null,"KF-75LW-3RF","广州科龙",null,"330205908000000183"]
{"$rows_left_out":146}
{"sheet":"衢州","index":4,"n_rows":24,"n_cols":16,"rows_kept":24}
["序号","报废批复文号","资产编号","资产名称","资产类别名称","资产原值\n（元，不含税）","资产净值\n（元，不含税）","累计折旧","资产数量","计量单位\n（个/吨/米等）","单节电池电压（2V/12V）","规格型号","生产厂家","站点名称","站点编码","实物备注"]
[1,"综合〔2023〕64号","\t330800000028","\t夏普 XG-FX8305A投影仪","投影仪",3158.97,94.77,3064.2,1,"台",null,"\t夏普 XG-FX8305A",null,"\t衢州市公共库位","330800"]
[2,"综合〔2023〕64号","\t330800000029","\t夏普 XG-FX850A投影仪","投影仪",4269.23,128.08,4141.15,1,"台",null,"\t夏普 XG-FX850A",null,"\t衢州市公共库位","330800"]
[3,"综合〔2023〕64号","\t330800000031","\t一体机","打印机设备",13700,411,13289,1,"台",null,"\t三星 SCX-8240NA",null,"\t衢州市公共库位","330800"]
[4,"综合〔2023〕64号","\t330800002922","\t台式电脑","办公设备电脑",4443.59,133.31,4310.28,1,"台",null,"\tDELL VOSTRO 3900-R5938C",null,"\t衢州市公共库位","330800"]
[5,"综合〔2023〕64号","\t330800304668","\t笔记本电脑","办公设备电脑",5247.86,157.44,5090.42,1,"台",null,"\tTHINKPAD X250",null,"\t衢州市公共库位","330800"]
[6,"综合〔2023〕64号","\t330800306035","\t黑白激光多功能一体机","打印机设备",2982.91,89.49,2893.42,1,"台",null,"\t佳能（Canon）MF229dw",null,"\t衢州市公共库位","330800"]
[7,"综合〔2023〕64号","\t330800311686","\t复印机","多功能一体化机",12820.51,384.62,12435.89,1,"台",null,"\t京瓷6525",null,"\t衢州市公共库位","330800"]
[8,"综合〔2023〕64号","\t330800321631","\t台式电脑","办公设备电脑",4238.46,127.15,4111.31,1,"台",null,"\tDELL",null,"\t衢州市公共库位","330800"]
[9,"综合〔2023〕64号","\t330800321623","\t台式电脑","办公设备电脑",4238.46,127.15,4111.31,1,"台",null,"\tDELL",null,"\t衢州市公共库位","330800"]
[10,"综合〔2023〕64号","\t330800321624","\t台式电脑","办公设备电脑",4238.46,127.15,4111.31,1,"台",null,"\tDELL",null,"\t衢州市公共库位","330800"]
[11,"综合〔2023〕64号","\t330800321636","\t台式电脑","办公设备电脑",4238.46,127.15,4111.31,1,"台",null,"\tDELL",null,"\t衢州市公共库位","330800"]
[12,"综合〔2024〕26号","\t330800000019","\tHP M451DN彩色激光打印机","打印机设备",4863.25,145.9,4717.35,1,"台",null,"HP M451DN",null,"\t衢州市公共库位","330800"]
[13,"综合〔2024〕26号","\t330800002911","\t打印机","打印机设备",760.68,22.82,737.86,1,"台",null,"HP P1108",null,"\t衢州市公共库位","330800"]
[14,"综合〔2024〕26号","\t330800320933","\t投影仪","投影仪",2221.37,66.64,2154.73,1,"台",null,"SONY VPL-EX231",null,"\t衢州市公共库位","330800"]
[15,"综合〔2024〕26号","\t330800321625","\t台式电脑","办公设备电脑",4238.46,127.15,4111.31,1,"台",null,"\tDELL",null,"\t衢州市公共库位","330800"]
[16,"综合〔2024〕26号","\t330800321626","\t台式电脑","办公设备电脑",4238.46,127.15,4111.31,1,"台",null,"\tDELL",null,"\t衢州市公共库位","330800"]
[17,"综合〔2024〕26号","\t330800321627","\t台式电脑","办公设备电脑",4238.46,127.15,4111.31,1,"台",null,"\tDELL",null,"\t衢州市公共库位","330800"]
[18,"综合〔2024〕26号","\t330800321628","\t台式电脑","办公设备电脑",4238.46,127.15,4111.31,1,"台",null,"\tDELL",null,"\t衢州市公共库位","330800"]
[19,"综合〔2024〕26号","\t330800321629","\t台式电脑","办公设备电脑",4238.46,127.15,4111.31,1,"台",null,"\tDELL",null,"\t衢州市公共库位","330800"]
{"$rows_left_out":5}
{"sheet":"湖州","index":5,"n_rows":63,"n_cols":21,"rows_kept":63}
["序号","报废批复文号","资产编号","资产名称","资产类别名称","资产原值\n（元，不含税","资产净值\n（元，不含税","累计折旧","资产数量","计量单位\n（个/吨/米等","规格","规格型号","生产厂家","站点名称","站点编码","启用日期","备注","实物位置","批号","是否处置","处置方式"]
[1,"总经理办公会纪要〔2024〕第 39 期","330500002244","普通空调柜式",null,6416.47,192.49,6223.98,{"v":1,"d":"1.00"},"台","3P","3P 三相柜式（单冷）",null,"南浔练市湾里村","33050300000001","2015/5/5","无铜管","中通仓库","无*3P*备注：无铜管*南浔练市湾里村*33050300000001**330500002244**废旧"]
[2,"总经理办公会纪要〔2024〕第 39 期","330500311471","普通空调壁挂",null,3606.97,108.21,3498.76,{"v":1,"d":"1.00"},"台","2P","2P单冷",null,"南浔江蒋漾西","330503500000000086","2017/5/31","无铜管","中通仓库","无*2P*备注：无铜管*南浔江蒋漾西*330503500000000086**330500311471**废旧"]
[3,"总经理办公会纪要〔2024〕第 39 期","330500316178","普通空调柜式",null,6925.77,207.77,{"v":6718,"d":"6718.00"},{"v":1,"d":"1.00"},"台","3P","3P单冷三相整机",null,"湖州南浔双林虹桥苑基站","330503908000000178","2017/12/12","无铜管","中通仓库","无*3P*备注：无铜管*湖州南浔双林虹桥苑基站*330503908000000178**330500316178**废旧"]
[4,"总经理办公会纪要〔2024〕第 39 期","330500112790","普通空调柜式",null,2106.92,63.21,2043.71,{"v":1,"d":"1.00"},"个","3P","基站专用柜式分体7KW单冷三相",null,"湖州南浔荃步村基站","330503908000000415","2015/10/31","无铜管","中通仓库","无*3P*备注：无铜管*湖州南浔荃步村基站*330503908000000415**330500112790**废旧"]
[5,"总经理办公会纪要〔2024〕第 39 期","330500123277","普通空调柜式",null,1545.75,46.37,1499.38,{"v":1,"d":"1.00"},"个","3P","3匹柜机",null,"湖州南浔练市东盛绸厂基站","330503908000000119","2015/10/31","无铜管","中通仓库","无*3P*备注：无铜管*湖州南浔练市东盛绸厂基站*330503908000000119**330500123277**废旧"]
[6,"湖州铁塔党委会纪要〔2024〕第 19 期","330500119435","组合式开关电源",null,{"v":5790.2,"d":"5790.20"},173.71,5616.49,{"v":1,"d":"1.00"},"个",null,"组合式48V-600A(50A模块)-200",null,"双林收费站","330503908000000548","2015/10/31",null,"中通仓库","无*组合式48V-600A(50A模块)-200**双林收费站*330522908000000170**330500119435**废旧"]
[7,"湖州铁塔党委会纪要〔2024〕第 19 期","330500112108","普通空调柜式",null,{"v":4050,"d":"4050.00"},{"v":121.5,"d":"121.50"},{"v":3928.5,"d":"3928.50"},{"v":1,"d":"1.00"},"个","3P","基站空调柜式-3P-单冷-三相交流-整机",null,"湖州南浔柏树村基站","330503908000000238","2015/10/31","无铜管","中通仓库","无*基站空调柜式-3P-单冷-三相交流-整机*备注：无铜管*湖州南浔柏树村基站*330521908000000682**330500112108**废旧"]
[8,"总经理办公会纪要〔2024〕第 24 期","330500122121","交流配电箱",null,385.58,11.57,374.01,{"v":1,"d":"1.00"},"面",null,"220V-63A",null,"吴兴东林余山","330502908000000339",20151031,null,"中通仓库","无*220V-63A**吴兴东林余山*330503500000000007**330500122121**废旧"]
[9,"湖州铁塔党委会纪要〔2024〕第 19 期","330500343419","动力及环境监控单元",null,4175.49,1588.15,2587.34,{"v":1,"d":"1.00"},"个",null,"主设备室内型成套设备双柜配置模型",null,"商合杭长兴金家庄","330522500000001705","2020/8/27",null,"中通仓库","无*动力及环境监控单元**商合杭长兴金家庄*33050301000012**330500343419**废旧"]
[10,"湖州铁塔党委会纪要〔2024〕第 19 期","330500002983","动力及环境监控单元",null,5182.69,155.48,5027.21,{"v":1,"d":"1.00"},"个",null,"主设备室内型成套设备双柜配置模型",null,"长兴范家桥","33052200000041","2015/4/30",null,"中通仓库","无*主设备室内型成套设备基本配置模型**长兴范家桥*330521908000000746**330500002983**废旧"]
[11,"总经理办公会纪要〔2024〕第 24 期","330500328398","动力及环境监控单元",null,2592.76,496.96,{"v":2095.8,"d":"2095.80"},{"v":1,"d":"1.00"},"个",null,"主设备室内型成套设备双柜配置模型",null,"安吉递铺宜茂","330523908000000959",20190306,null,"中通仓库","无*主设备室内型成套设备基本配置模型**安吉递铺宜茂*330521500000000159**330500328398**废旧"]
[12,"湖州铁塔党委会纪要〔2024〕第 19 期","330500320006","动力及环境监控单元",null,3672.65,159.65,{"v":3513,"d":"3513.00"},{"v":1,"d":"1.00"},"个",null,"主设备室内型成套设备双柜配置模型",null,"长兴雉城云宇财富城","330522908000000341","2018/7/18",null,"中通仓库","无*主设备室内型成套设备双柜配置模型**长兴雉城云宇财富城*330522908000000030**330500320006**废旧"]
[13,"湖州铁塔党委会纪要〔2024〕第 19 期","330500320004","动力及环境监控单元",null,3672.65,159.65,{"v":3513,"d":"3513.00"},{"v":1,"d":"1.00"},"个",null,"主设备室内型成套设备双柜配置模型",null,"长兴李家巷开发区","330522010000000199","2018/7/18",null,"中通仓库","无*主设备室内型成套设备基本配置模型**长兴李家巷开发区*330502908000000315**330500320004**废旧"]
[14,"湖州铁塔党委会纪要〔2024〕第 19 期","330500311890","动力及环境监控单元",null,3731.76,111.95,3619.81,{"v":1,"d":"1.00"},"个",null,"主设备室内型成套设备双柜配置模型",null,"长兴紫金路西（浙水阳光南）","330522500000000216","2017/6/16",null,"中通仓库","无*主设备室内型成套设备基本配置模型**长兴紫金路西（浙水阳光南）*330502908000000331**330500311890**废旧"]
[15,"湖州铁塔党委会纪要〔2024〕第 19 期","330500004926","嵌入式开关电源",null,3996.78,{"v":119.9,"d":"119.90"},3876.88,{"v":1,"d":"1.00"},"架",null,"嵌入式开关电源32A/3Px1（室外标准机柜用）",null,"吴兴仁皇山科技局","330502500000000038","2015/11/13",null,"中通仓库","无*嵌入式开关电源32A/3Px1（室外标准机柜用）**吴兴仁皇山科技局*330522908000000914**330500004926**废旧"]
[16,"总经理办公会纪要〔2024〕第 24 期","330500315702","嵌入式开关电源",null,4658.59,139.76,4518.83,{"v":1,"d":"1.00"},"架",null,"48V/300A高效系统(50A高效模块，共用电源系统，三相交流输入)100A",null,"安吉天荒坪颜家","330523908000000633",20171102,null,"中通仓库","无*48V/300A高效系统(50A高效模块，共用电源系统，三相交流输入)100A**安吉天荒坪颜家*330521908000000663**330500315702**废旧"]
[17,"总经理办公会纪要〔2024〕第 24 期","330500334909","动力及环境监控单元",null,2585.14,{"v":704.4,"d":"704.40"},1880.74,{"v":1,"d":"1.00"},"个",null,"主设备室内型成套设备双柜配置模型",null,"湖州南浔灯塔村基站","330503908000000366",20190905,null,"中通仓库","无*主设备室内型成套设备基本配置模型**湖州南浔灯塔村基站*330502908000000654**330500334909**废旧"]
[18,"总经理办公会纪要〔2024〕第 24 期","330500328552","动力及环境监控单元",null,2592.76,496.96,{"v":2095.8,"d":"2095.80"},{"v":1,"d":"1.00"},"个",null,"主设备室内型成套设备双柜配置模型",null,"湖州南浔灯塔村基站","330503908000000366",20190310,null,"中通仓库","无*主设备室内型成套设备基本配置模型**湖州南浔灯塔村基站*330522908000000091**330500328552**废旧"]
[19,"总经理办公会纪要〔2024〕第 24 期","330500330658","动力及环境监控单元",null,2572.46,527.68,2044.78,{"v":1,"d":"1.00"},"个",null,"主设备室内型成套设备双柜配置模型",null,"湖州南浔千金南窑桥基站","330503908000000265",20190403,null,"中通仓库","无*主设备室内型成套设备基本配置模型**湖州南浔千金南窑桥基站*330502908000000473**330500330658**废旧"]
{"$rows_left_out":44}
{"sheet":"温州","index":6,"n_rows":184,"n_cols":16,"rows_kept":184}
["序号","报废批复文号","资产编号","资产名称","资产类别名称","资产原值\n（元，不含税）","资产净值\n（元，不含税）","累计折旧","资产数量","计量单位\n（个/吨/米等）","规格型号","生产厂家","站点名称","站点编码","提供人","备注"]
[1,"温州铁塔党委会纪要〔2020〕第 7 期","330300133444","FSU","FSU",1693.02,50.79,1642.23,{"v":1,"d":"1.00"},"个","/","无","苍南灵溪商城商厦","330327908000001102","蔡煌湖"]
[2,"温州铁塔党委会纪要〔2020〕第 7 期","330300146718","FSU","FSU",1345.67,40.37,1305.3,{"v":1,"d":"1.00"},"个","/","无","温州绿色乐园","330304908000000138","蔡煌湖"]
[3,"温州铁塔党委会纪要〔2020〕第 7 期","330300148259","FSU","FSU",1170.27,35.11,1135.16,{"v":1,"d":"1.00"},"个","/","无","平阳鳌江实验小学-2","330326908000000706","蔡煌湖"]
[4,"总经理办公会纪要〔2023〕第 9 期","330300371312","机柜","机柜",7316.21,219.49,7096.72,{"v":1,"d":"1.00"},"个","/","无","温州鹿城岙底白脚坳","330302908000001001","王智淳"]
[5,"总经理办公会纪要〔2023〕第 9 期","330300124236","嵌入式开关电源","嵌入式开关电源",2490.44,74.71,2415.73,{"v":1,"d":"1.00"},"架","嵌入式","中恒","温州职工中等卫校","330302908000000263","王智淳"]
[6,"总经理办公会纪要〔2023〕第 9 期","330300161028","机柜","机柜",14118.51,423.56,13694.95,{"v":1,"d":"1.00"},"个","/","无","温州鹿城世贸中心","330302908000000784","王智淳"]
[7,"总经理办公会纪要〔2023〕第 9 期","330300140205","机柜散件","机柜散件",1037.12,31.11,1006.01,{"v":1,"d":"1.00"},"个","/","无","温州雪山饭店","330304908000000172","王智淳"]
[8,"总经理办公会纪要〔2023〕第 21 期","330300157901","组合式开关电源","组合式开关电源",5072.6,152.18,4920.42,{"v":1,"d":"1.00"},"架","组合式","中恒电","瑞安官渎TD","330381908000000791","王智淳","少配件"]
[9,"总经理办公会纪要〔2023〕第 26 期","330300107931","交流配电箱","交流配电箱",2372.36,569.72,1802.64,{"v":1,"d":"1.00"},"个","/","无","永嘉下寮芬益","330324908000001033","蔡煌湖"]
[10,"生产经营会纪要〔2023〕第3期","330300162105","嵌入式开关电源","嵌入式开关电源",1677.4,50.3200000000002,1627.08,{"v":1,"d":"1.00"},"架","嵌入式","无","泰顺罗阳岭下","330329908000000666","蔡煌湖"]
[11,"生产经营会纪要〔2023〕第3期","330300329662","交流配电箱","交流配电箱",3679.34,110.38,3568.96,{"v":1,"d":"1.00"},"个","/","甬发","文成岙底","33032800000063","蔡煌湖"]
[12,"总经理办公会纪要〔2024〕第12期","330300352647","嵌入式开关电源","嵌入式开关电源",5879.14,176.37,5702.77,{"v":1,"d":"1.00"},"架","嵌入式","中恒","瑞安仙降新安东","33038101000160","王智淳","无黄色标签少配件"]
[13,"温州铁塔党委会纪要(2024)第13期","330300140164","组合式开关电源","组合式开关电源",{"v":9192.88,"d":"9,192.88"},275.79,{"v":8917.09,"d":"8,917.09"},{"v":1,"d":"1.00"},"架","组合式","中恒","平阳水头开发区","330326908000000055","王智淳"]
[14,"温州铁塔党委会纪要(2024)第13期","330300302587","铝线","铝线",1645.05,301.95,1343.1,{"v":1,"d":"1.00"},"根","/","亨通","温州龙湾沙城自营厅","330303908000000580","王智淳","15米"]
[15,"温州铁塔党委会纪要〔2024〕第17期","330300367209","FSU","FSU",2903.63,87.11,2816.52,{"v":1,"d":"1.00"},"个","/","中兴","乐清双峰老鼠嘴村","33038200000151","蔡煌湖","无配件"]
[16,"温州铁塔党委会纪要〔2024〕第17期","330300362091","整流模块","整流模块",2114.26,63.43,2050.83,{"v":1,"d":"1.00"},"个","/","中恒","温州永中镇标路","330303908000000867","蔡煌湖"]
[17,"温州铁塔党委会纪要〔2024〕第17期","330300362092","整流模块","整流模块",2114.26,63.43,2050.83,{"v":1,"d":"1.00"},"个","/","中恒","温州永中镇标路","330303908000000867","蔡煌湖"]
[18,"温州铁塔党委会纪要〔2024〕第17期","330300351027","嵌入式开关电源","嵌入式开关电源",6284.76,188.54,6096.22,{"v":1,"d":"1.00"},"架","嵌入式","中恒","温州龙湾龙湾恒力弹簧","330303908000000250","王智淳","少配件"]
[19,"温州铁塔党委会纪要〔2024〕第17期","330300373812","嵌入式开关电源","嵌入式开关电源",7579.71,227.39,7352.32,{"v":1,"d":"1.00"},"架","嵌入式","中恒","瑞安蜘蛛王南","33038101000159","王智淳","配一个监控器，一个模块"]
{"$rows_left_out":164}