{"text_format":"3","workbook":"xlsx","n_sheets":4,"sheets":["地市透视表","汇总","宁波","绍兴"],"not_rendered":{"images":3,"external_links":1,"defined_names":5},"read":"whole","date_system":"1900"}

{"sheet":"地市透视表","index":0,"n_rows":4,"n_cols":6,"rows_kept":4,"merged":[[0,9,1,9],[0,10,1,10],[0,11,0,15]]}
["地市","资产条数","资产原值（元）","资产净值（元）","净值/原值","评估价（元）"]
["宁波",12,78453.88,2353.61,{"$f":"D2/C2","v":{"v":0.02999991842341,"d":"3.00%"}},{"v":1695.2,"d":"1695.20"}]
["绍兴",113,354515.08,24233.91,{"$f":"D3/C3","v":{"v":0.0683579101910136,"d":"6.84%"}},{"v":38423.58887,"d":"38423.59"}]
["合计",{"$f":"SUM(B2:B3)","v":125},{"$f":"SUM(C2:C3)","v":432968.96},{"$f":"SUM(D2:D3)","v":26587.52},{"$f":"D4/C4","v":{"v":0.0614074505479561,"d":"6.14%"}},{"$f":"SUM(F2:F3)","v":{"v":40118.78887,"d":"40118.79"}}]

{"sheet":"汇总","index":1,"n_rows":21,"n_cols":11,"rows_kept":21,"merged":[[2,6,4,6],[2,9,4,9],[66,4,67,4],[66,5,67,5]]}
["地市","拍卖批次","资产类别名称（大类相同完整度不同的分行填报）","对应估值清单的分类描述","计量单位","资产数量","总重量（kg）","完整度/出铜（铝）率（%）","最低转让单价（含税）","最低转让总价（含税）","备注\n（主要配件缺失的需要注明）"]
["宁波","第二十五批","3P空调","3匹室内外成套","台",1,null,{"v":0,"d":"0%"},936,{"$f":"I2*F2","v":936},"无铜管"]
["宁波","第二十五批","整流模块","其他各类铁质为主的报废物资","个",1,160,null,"2270元/吨",{"$f":"2270/1000*G3","v":363.2},"无配件"]
["宁波","第二十五批","壁挂式开关电源","其他各类铁质为主的报废物资","架",1,null,null,"2270元/吨",null,"无配件"]
["宁波","第二十五批","嵌入式开关电源","其他各类铁质为主的报废物资","架",7,null,null,"2270元/吨",null,"无配件"]
["宁波","第二十五批","组合式开关电源","组合式开关电源","架",2,null,{"v":0,"d":"0%"},"997×完整度+198",{"$f":"(997*H6+198)*F6","v":{"v":396,"d":"396.00"}},"无配件"]
["绍兴","第二十五批","铜线","铜缆类","米",36,49.3,{"v":0.23,"d":"23%"},"70510元/吨×出铜率",{"$f":"70510/1000*H7*G7","v":{"v":799.51289,"d":"799.51"}},"称重"]
["绍兴","第二十五批","开关电源","组合式开关电源","架",35,"/",{"v":0,"d":"0%"},"997×完整度+198",{"$f":"(997*H8+198)*F8","v":{"v":6930,"d":"6930.00"}},"不称重，填写完成率"]
["绍兴","第二十五批","开关电源","其他各类铁质为主的报废物资","架",18,367.2,null,"2270元/吨",{"$f":"2270/1000*G9","v":833.544},"称重"]
["绍兴","第二十五批","空调","3匹室内外成套","台",29,"/",null,936,{"$f":"F10*I10","v":{"v":27144,"d":"27144.00"}},"套用单价"]
["绍兴","第二十五批","空调","3匹（无外机）","台",1,"/",null,454,{"v":454,"d":"454.00"},"1台无外机"]
["绍兴","第二十五批","空调","3匹（无压缩机）","台",1,"/",null,659,{"v":659,"d":"659.00"},"1台无压缩机"]
["绍兴","第二十五批","直流配电箱","配电箱类","个",1,6,null,107,{"v":107,"d":"107.00"},"称重"]
["绍兴","第二十五批","空调","2P及2P以下成套空调","台",1,"/",null,520,{"v":520,"d":"520.00"},"套用单价"]
["绍兴","第二十五批","汇流条","其他各类铁质为主的报废物资","段",6,24,null,"2270元/吨",{"$f":"2270/1000*G15","v":54.48},"称重"]
["绍兴","第二十五批","机柜","其他各类铁质为主的报废物资","个",1,103,null,"2270元/吨",233.81,"称重"]
["绍兴","第二十五批","监控","动环监控","个",3,"/",null,16,{"$f":"F17*I17","v":{"v":48,"d":"48.00"}},"套用单价"]
["绍兴","第二十五批","接地铜牌","其他各类铁质为主的报废物资","块",6,12,null,"2270元/吨",27.24,"称重"]
["绍兴","第二十五批","电表","其他各类铁质为主的报废物资","个",2,5,null,"2270元/吨",11.35,"称重"]
["绍兴","第二十五批","铝线","铝缆类","米",102,71.4,{"v":0.23,"d":"23%"},"17090元/吨×出铝率",{"$f":"17090/1000*H20*G20","v":{"v":280.65198,"d":"280.65"}},"称重"]
["绍兴","第二十五批","交流配电箱","配电箱类","个",3,"/",null,107,{"$f":"F21*I21","v":{"v":321,"d":"321.00"}},"套用单价"]

{"sheet":"宁波","index":2,"n_rows":13,"n_cols":16,"rows_kept":13}
["序号","报废批复文号","资产编号","批次","资产名称","资产类别名称","资产原值","资产净值","累计折旧","资产数量","计量单位\n（个/吨/米等）","单节电池电压（2V/12V）","规格型号","生产厂家","站点名称","站点编码"]
[1,"宁波铁塔党委会纪要〔2022〕第 21 期","330200325006",null,"嵌入式开关电源32A/3P*1（室外标准机柜用）","嵌入式开关电源",9756.93,292.71,9464.22,1,"架",null,"ETP48200",{"$f":"VLOOKUP(C2,'[1]00资产已报废'!$B:$P,13,0)","v":"中达电通股份有限公司"},null,"330283500000000100"]
[2,"宁波铁塔总经理办公会纪要〔2023〕第 66 期","330200323542",null,"嵌入式开关电源32A/3P*1（室外标准机柜用）","组合式开关电源",3728.85,111.87,3616.98,1,"架",null,"(杭州中恒)-开关电源及电源模块-开关电源",{"$f":"VLOOKUP(C3,'[1]00资产已报废'!$B:$P,13,0)","v":"杭州中恒电气股份有限公司"},null,"330282908000001357"]
[3,"宁波铁塔总经理办公会纪要〔2023〕第 66 期","330200342274",null,"(中达电通)-开关电源及电源模块-开关电源","嵌入式开关电源",5401.49,162.04,5239.45,1,"架",null,"嵌入式开关电源32A/3P*1（室外标准机柜用）",{"$f":"VLOOKUP(C4,'[1]00资产已报废'!$B:$P,13,0)","v":"中达电通股份有限公司"},null,"330225500000000051"]
[4,"宁波铁塔总经理办公会纪要〔2023〕第 66 期","330200333118",null,"嵌入式开关电源","嵌入式开关电源",7535.76,226.07,7309.69,1,"架",null,"48V/300A高效系统(50A高效模块，共用电源系统，三相交流输入)100A",null,null,"330206500000000179"]
[5,"宁波铁塔总经理办公会纪要〔2023〕第 66 期","330200342275",null,"(杭州中恒)-开关电源及电源模块-开关电源","嵌入式开关电源",5442.39,163.27,5279.12,1,"架",null,"嵌入式开关电源32A/3P*1（室外标准机柜用）",{"$f":"VLOOKUP(C6,'[1]00资产已报废'!$B:$P,13,0)","v":"杭州中恒电气股份有限公司"},null,"330225500000000051"]
[6,"宁波铁塔总经理办公会纪要〔2023〕第 66 期","330200320887",null,"嵌入式开关电源","嵌入式开关电源",5826.94,174.81,5652.13,1,"架",null,"嵌入式开关电源32A/3P*1（室外标准机柜用）",{"$f":"VLOOKUP(C7,'[1]00资产已报废'!$B:$P,13,0)","v":"中达电通股份有限公司"},null,"330206500000000009"]
[7,"宁波铁塔总经理办公会纪要〔2023〕第 66 期","330200334704",null,"嵌入式开关电源","嵌入式开关电源",5929.29,177.88,5751.41,1,"架",null,"48V/300A高效系统(50A高效模块，共用电源系统，三相交流输入)100A",null,null,"330225908000000494"]
[8,"宁波铁塔总经理办公会纪要〔2023〕第 66 期","330200010927",null,"(杭州中恒)-开关电源及电源模块-开关电源","组合式开关电源",10849.77,325.49,10524.28,1,"架",null,"壁挂式开关电源32A/3P*1",{"$f":"VLOOKUP(C9,'[1]00资产已报废'!$B:$P,13,0)","v":"杭州中恒电气股份有限公司"},null,"330212908000001518"]
[9,"宁波铁塔总经理办公会纪要〔2023〕第 66 期","330200338089",null,"嵌入式开关电源","嵌入式开关电源",5605.71,168.17,5437.54,1,"架",null,"48V/300A高效系统(50A高效模块，共用电源系统，三相交流输入)100A",null,null,"330282908000001100"]
[10,"总经理办公会纪要〔2024〕第 3 期","330200330603",null,"(北京融和创)-空调及空调零部件-空调","基站空调柜式",6241.11,187.23,6053.88,1,"台",null,"3P 三相柜式（单冷）",{"$f":"VLOOKUP(C11,'[1]00资产已报废'!$B:$P,13,0)","v":"北京融和创科技有限公司"},null,"330212010000001315"]
[11,"总经理办公会纪要〔2024〕第 3 期","330200341617",null,"(杭州中恒)-开关电源及电源模块-开关电源","壁挂式开关电源",5037.09,151.11,4885.98,1,"架",null,"壁挂式开关电源32A/3P*1",{"$f":"VLOOKUP(C12,'[1]00资产已报废'!$B:$P,13,0)","v":"杭州中恒电气股份有限公司"},null,"33021101000099"]
[12,"总经理办公会纪要〔2024〕第7期","330200343011",null,"(杭州中恒)-开关电源及电源模块-开关电源模块","整流模块",7098.55,212.96,6885.59,1,"个",null,"50A（普效模块）",{"$f":"VLOOKUP(C13,'[1]00资产已报废'!$B:$P,13,0)","v":"杭州中恒电气股份有限公司"},null,"330212908000001805"]

{"sheet":"绍兴","index":3,"n_rows":114,"n_cols":14,"rows_kept":114}
["序号","报废批复文号","资产编号","资产名称","资产类别名称","资产原值\n（元，不含税）","资产净值\n（元，不含税）","累计折旧","资产数量","计量单位\n（个/吨/米等）","规格型号","生产厂家","站点名称","站点编码"]
[1,"绍兴市分公司党委2024年第23次党委会会议纪要","330600002476","空调","空调",6274.19,188.23,6085.96,"台",1,"3P 三相柜式（单冷）",null,"上虞小越","330682908000000942"]
[2,"绍兴市分公司党委2024年第23次党委会会议纪要","330600101673","开关电源","开关电源",848.95,25.47,823.48,"架",1,"48V-450A(50A模块)-200A",null,"绍兴市新昌县七星街道岩里","330624908000000381"]
[3,"绍兴市分公司党委2024年第23次党委会会议纪要","330600102304","开关电源","开关电源",631.15,18.93,612.22,"架",1,"48V-450A(50A模块)-100A",null,"绍兴市越城区府山街道现代大厦街道站","330602908000000882"]
[4,"绍兴市分公司党委2024年第21次党委会会议纪要","330600102606","开关电源","开关电源",1025,30.75,994.25,"架",1,"48V-600A(50A模块)-150",null,"绍兴市越城区皋埠镇刁泥山村","330602908000000319"]
[5,"绍兴市分公司党委2024年第23次党委会会议纪要","330600102910","开关电源","开关电源",707.4,21.22,686.18,"架",1,"48V-300A(50A模块)-150A",null,"绍兴市越城区福全镇七贤桥","330600908000000110"]
[6,"绍兴市分公司党委2024年第23次党委会会议纪要","330600103411","开关电源","开关电源",3003.01,90.09,2912.92,"架",1,"IMPS81013(150A)",null,"绍兴上埠","330602908000001078"]
[7,"绍兴市分公司党委2024年第23次党委会会议纪要","330600103544","开关电源","开关电源",649.8,19.49,630.31,"架",1,"PS48400-3-2900",null,"绍兴漓渚TieK","330600908000000033"]
[8,"绍兴市分公司党委2024年第21次党委会会议纪要","330600103727","开关电源","开关电源",3975.24,119.26,3855.98,"架",1,"48-24A(6A模块)-12",null,"绍兴柯桥柯岩医院","330600908000000512"]
[9,"绍兴市分公司党委2024年第23次党委会会议纪要","330600105805","开关电源","开关电源",6186.76,185.6,6001.16,"架",1,"48V-600A(50A模块)-150A",null,"绍兴市诸暨市山下湖镇万金机械","330681908000000892"]
[10,"绍兴市分公司党委2024年第23次党委会会议纪要","330600105806","开关电源","开关电源",2286.6,68.6,2218,"架",1,"48V-300A(50A模块)-100A",null,"绍兴市诸暨市牌头镇西大庄","330681908000001061"]
[11,"绍兴市分公司党委2024年第23次党委会会议纪要","330600106175","开关电源","开关电源",598.75,17.96,580.79,"架",1,"48V-300A(50A模块)-100A",null,"绍兴市上虞市盖北镇盖北沿海","330682908000000848"]
[12,"绍兴市分公司党委2024年第23次党委会会议纪要","330600106661","空调","空调",206,6.18,199.82,"台",1,"RF73WDT",null,"绍兴市新昌县镜岭镇雅庄","330624908000000213"]
[13,"绍兴市分公司党委2024年第23次党委会会议纪要","330600106693","空调","空调",257.5,7.73,249.77,"台",1,"RF73WDT",null,"绍兴市嵊州市剡湖街道西大湾","330683908000000477"]
[14,"绍兴市分公司党委2024年第23次党委会会议纪要","330600107275","开关电源","开关电源",3683.8,110.51,3573.29,"架",1,"48V-300A(50A模块)-100A",null,"绍兴市新昌县城南乡荷花塘","330624908000000312"]
[15,"绍兴市分公司党委2024年第23次党委会会议纪要","330600107298","空调","空调",281.31,8.44,272.87,"台",1,"RF73WDT",null,"诸暨大唐华海搬迁","330681500000000325"]
[16,"绍兴市分公司党委2024年第23次党委会会议纪要","330600107602","开关电源","开关电源",246.6,7.4,239.2,"架",1,"MSC-48-150-YLUA1",null,"诸暨关五","330681908000000071"]
[17,"绍兴市分公司党委2024年第23次党委会会议纪要","330600107672","开关电源","开关电源",707.4,21.22,686.18,"架",1,"48V-300A(50A模块)-150A",null,"绍兴市越城区鉴湖镇王家葑","330602908000000685"]
[18,"绍兴市分公司党委2024年第23次党委会会议纪要","330600107688","开关电源","开关电源",199.5,5.99,193.51,"架",1,"48V-300A(50A模块)-100A",null,"诸暨城关王谷北","330681500000001669"]
[19,"绍兴市分公司党委2024年第23次党委会会议纪要","330600107696","开关电源","开关电源",598.75,17.96,580.79,"架",1,"48V-300A(50A模块)-100A",null,"绍兴市诸暨市东和乡东和王六","330681908000000459"]
[20,"绍兴市分公司党委2024年第23次党委会会议纪要","330600111002","开关电源","开关电源",291.2,8.74,282.46,"架",1,"48V-600A(50A模块)-100A",null,"绍兴市越城区北海街道富临名家","330602908000000796"]
[21,"绍兴市分公司党委2024年第23次党委会会议纪要","330600111077","开关电源","开关电源",369.78,11.09,358.69,"架",1,"48V-300A(50A模块)-200A",null,"绍兴市诸暨市浣东街道白鱼坛","330681908000000810"]
[22,"绍兴市分公司党委2024年第23次党委会会议纪要","330600111136","开关电源","开关电源",598.75,17.96,580.79,"架",1,"48V-300A(50A模块)-100A",null,"绍兴市诸暨市同山镇同山五宅畈","330681908000000702"]
[23,"绍兴市分公司党委2024年第23次党委会会议纪要","330600111139","开关电源","开关电源",320.43,9.61,310.82,"架",1,"48V-300A(50A模块)-150A",null,"绍兴市诸暨市同山镇同山王沙溪","330681908000000520"]
[24,"绍兴市分公司党委2024年第23次党委会会议纪要","330600111210","开关电源","开关电源",898.2,26.95,871.25,"架",1,"48V-600A(50A模块)-100",null,"绍兴朱家桥","330602908000000108"]
[25,"绍兴市分公司党委2024年第21次党委会会议纪要","330600112877","开关电源","开关电源",1084.8,32.54,1052.26,"架",1,"48-24A(6A模块)-12",null,"绍兴稽东傅家岙","330600908000000747"]
[26,"绍兴市分公司党委2024年第23次党委会会议纪要","330600112878","开关电源","开关电源",534.48,16.03,518.45,"架",1,"48-24A(6A模块)-12",null,"绍兴市新昌县巧英乡平砚","330624908000000399"]
[27,"绍兴市分公司党委2024年第21次党委会会议纪要","330600113316","配电箱","配电箱",3422.36,102.67,3319.69,"个",1,"KBP3-2-7WH（100A）",null,"诸暨五纹岭","330681908000000168"]
[28,"绍兴市分公司党委2024年第23次党委会会议纪要","330600113703","开关电源","开关电源",4251.15,127.53,4123.62,"架",1,"48V-600A(50A模块)-300A",null,"绍兴市绍兴县杨汛桥镇高家村","330600908000000668"]
[29,"绍兴市分公司党委2024年第23次党委会会议纪要","330600113938","开关电源","开关电源",4792.16,143.76,4648.4,"架",1,"48V-300A(50A模块)-100A",null,"绍兴市上虞市百官镇百官东山路","330682908000000836"]
[30,"绍兴市分公司党委2024年第23次党委会会议纪要","330600114009","开关电源","开关电源",1152,34.56,1117.44,"架",1,"48V-600A(50A模块)-350A",null,"绍兴市上虞市百官镇秀水苑搬迁","330682500000001630"]
[31,"绍兴市分公司党委2024年第23次党委会会议纪要","330600114057","开关电源","开关电源",2114.47,63.43,2051.04,"架",1,"48V-300A(50A模块)-150A",null,"绍兴市绍兴县湖塘街道余家埭","330600908000000658"]
[32,"绍兴市分公司党委2024年第23次党委会会议纪要","330600114466","开关电源","开关电源",5304.85,159.15,5145.7,"架",1,"48V-150A(50A模块)-100",null,"绍兴市上虞市曹娥街道辉煌线业","330682908000000383"]
[33,"绍兴市分公司党委2024年第23次党委会会议纪要","330600114658","开关电源","开关电源",1090.2,32.71,1057.49,"架",1,"48V-150A(50A模块)-100",null,"绍兴市越城区城南街道城南凤凰路公路站","330602908000000379"]
[34,"绍兴市分公司党委2024年第21次党委会会议纪要","330600114668","开关电源","开关电源",1090.2,32.71,1057.49,"架",1,"48V-150A(50A模块)-100",null,"绍兴市越城区稽山街道波影大酒店","330602908000000315"]
[35,"绍兴市分公司党委2024年第23次党委会会议纪要","330600114802","空调","空调",207,6.21,200.79,"台",1,"RF73WDT",null,"绍兴市诸暨市应店街镇镇洪里坞","330681908000000674"]
[36,"绍兴市分公司党委2024年第21次党委会会议纪要","330600114804","空调","空调",231.75,6.95,224.8,"台",1,"RF73WDT",null,"绍兴市诸暨市马剑镇马剑相公殿","330681908000000582"]
[37,"绍兴市分公司党委2024年第23次党委会会议纪要","330600115016","空调","空调",2398.22,71.95,2326.27,"台",1,"RF73WDT",null,"绍兴市诸暨市江藻镇梓里村和尚武村","330681908000000569"]
[38,"绍兴市分公司党委2024年第21次党委会会议纪要","330600115119","空调","空调",257.5,7.73,249.77,"台",1,"RF73WDT",null,"新昌翡翠山","330624500010001544"]
[39,"绍兴市分公司党委2024年第21次党委会会议纪要","330600115386","空调","空调",154.5,4.64,149.86,"台",1,"MSH-LC19CD",null,"绍兴稽东柳岙","330602908000000813"]
[40,"绍兴市分公司党委2024年第21次党委会会议纪要","330600115897","空调","空调",4626,138.78,4487.22,"台",1,"KF-72LW-JH1SM(R2)（3匹）7.5KW",null,"绍兴市越城区皋埠镇刁泥山村","330602908000000319"]
[41,"绍兴市分公司党委2024年第23次党委会会议纪要","330600116345","空调","空调",1164,34.92,1129.08,"台",1,"RF73WDT",null,"绍兴市新昌县镜岭","330624908000000214"]
[42,"绍兴市分公司党委2024年第23次党委会会议纪要","330600124044","配电箱","配电箱",2921.86,87.66,2834.2,"个",1,"NXK1",null,"绍兴洋江","330602908000000236"]
[43,"绍兴市分公司党委2024年第23次党委会会议纪要","330600124045","开关电源","开关电源",1146.6,34.4,1112.2,"架",1,"48V-600A(50A模块)-100",null,"绍兴洋江","330602908000000236"]
[44,"绍兴市分公司党委2024年第23次党委会会议纪要","330600124192","开关电源","开关电源",631.15,18.93,612.22,"架",1,"48V-450A(50A模块)-100A",null,"绍兴市新昌县回山镇植林","330624908000000444"]
[45,"绍兴市分公司党委2024年第23次党委会会议纪要","330600124391","开关电源","开关电源",1683.77,50.51,1633.26,"架",1,"48V-600A(50A模块)-100",null,"诸暨应店街崇柱","330681908000001540"]
[46,"绍兴市分公司党委2024年第23次党委会会议纪要","330600124752","开关电源","开关电源",1021.75,30.65,991.1,"架",1,"PS48400-2C-50-艾默生",null,"嵊州蛟镇","330683908000000017"]
[47,"绍兴市分公司党委2024年第23次党委会会议纪要","330600127047","开关电源","开关电源",898.2,26.95,871.25,"架",1,"48V-600A(50A模块)-100",null,"绍兴市虚拟站","330600880000000000"]
[48,"绍兴市分公司党委2024年第23次党委会会议纪要","330600127615","空调","空调",1131,33.93,1097.07,"台",1,"RF73WDT",null,"绍兴市越城区北海街道富临名家","330602908000000796"]
[49,"绍兴市分公司党委2024年第23次党委会会议纪要","330600127735","空调","空调",231.75,6.95,224.8,"台",1,"SPW-V254DH5",null,"上虞上浦江水沿","330682908000000182"]
[50,"绍兴市分公司党委2024年第23次党委会会议纪要","330600128063","空调","空调",358.54,10.76,347.78,"台",1,"RF73WDT（3匹）7.5KW",null,"绍兴市诸暨市陶朱街道张家村","330681908000000606"]
[51,"绍兴市分公司党委2024年第23次党委会会议纪要","330600128164","空调","空调",231.75,6.95,224.8,"台",1,"SPW-V254DH5",null,"柯桥钱清新甸搬迁","330621500000000249"]
[52,"绍兴市分公司党委2024年第23次党委会会议纪要","330600128299","空调","空调",2003.75,60.11,1943.64,"台",1,"LE75WGT-LFC75WGT",null,"新昌庙外","330624908000000121"]
[53,"绍兴市分公司党委2024年第23次党委会会议纪要","330600128405","空调","空调",103,3.09,99.91,"台",1,"LF75WGT",null,"绍兴市虚拟站","330600880000000000"]
[54,"绍兴市分公司党委2024年第23次党委会会议纪要","330600128496","空调","空调",257.5,7.73,249.77,"台",1,"RF73WDT",null,"绍兴市新昌县七星街道西郊中学","330624908000000233"]
[55,"绍兴市分公司党委2024年第23次党委会会议纪要","330600129491","开关电源","开关电源",4597.48,137.92,4459.56,"架",1,"100A(50A高效-满架300A)",null,"绍兴城南禹陵渡假","330602908000000339"]
[56,"绍兴市分公司党委2024年第23次党委会会议纪要","330600129821","开关电源","开关电源",898.2,26.95,871.25,"架",1,"48V-400A(50A模块)-150",null,"诸暨周庄","330681908000001345"]
[57,"绍兴市分公司党委2024年第23次党委会会议纪要","330600132105","开关电源","开关电源",1021.75,30.65,991.1,"架",1,"PS48400-2C-50",null,"绍兴城南邮电技校西","330602500000000144"]
[58,"绍兴市分公司党委2024年第23次党委会会议纪要","330600135120","开关电源","开关电源",4566.38,136.99,4429.39,"架",1,"48V-600A(50A模块)-200A",null,"绍兴市越城区北海街道香滨半岛","330602908000000650"]
[59,"绍兴市分公司党委2024年第23次党委会会议纪要","330600303608","开关电源","开关电源",4135.82,124.07,4011.75,"架",1,"1U4840-40A室外型成套后备电源",null,"诸暨泉畈","330681908000000270"]
[60,"绍兴市分公司党委2024年第23次党委会会议纪要","330600305363","开关电源","开关电源",11199.46,335.98,10863.48,"架",1,"嵌入式高频开关电源-48V/200A高效系统(50A高效模块，共用电源系统，三相交流输入)-150A",null,"绍兴陶堰大横江","330602908000000885"]
[61,"绍兴市分公司党委2024年第23次党委会会议纪要","330600305812","开关电源","开关电源",5699.26,170.98,5528.28,"架",1,"嵌入式高频开关电源-48V/200A高效系统(50A高效模块，共用电源系统，三相交流输入)-100A",null,"绍兴越城城南中成新村西","330602500000001366"]
[62,"绍兴市分公司党委2024年第23次党委会会议纪要","330600305824","开关电源","开关电源",8130,243.9,7886.1,"架",1,"嵌入式高频开关电源-48V/200A高效系统(50A高效模块，共用电源系统，三相交流输入)-100A",null,"绍兴蔡家岙","330600908000000965"]
[63,"绍兴市分公司党委2024年第23次党委会会议纪要","330600311373","空调","空调",7111.46,213.34,6898.12,"台",1,"3P单冷三相整机",null,"绍兴洋江","330602908000000236"]
[64,"绍兴市分公司党委2024年第23次党委会会议纪要","330600312337","空调","空调",6327.79,189.83,6137.96,"台",1,"3P单冷三相整机",null,"绍兴江桥","330600908000000034"]
[65,"绍兴市分公司党委2024年第23次党委会会议纪要","330600312446","空调","空调",6698.27,200.95,6497.32,"台",1,"3P单冷三相整机",null,"诸暨邮政","330681908000000024"]
[66,"绍兴市分公司党委2024年第23次党委会会议纪要","330600313554","空调","空调",3675.48,110.26,3565.22,"台",1,"2P单冷单相整机",null,"绍兴市虚拟站","330600880000000000"]
[67,"绍兴市分公司党委2024年第23次党委会会议纪要","330600315637","空调","空调",5679.52,170.39,5509.13,"台",1,"3P柜机",null,"诸暨大唐华海集团","330681500000000102"]
[68,"绍兴市分公司党委2024年第23次党委会会议纪要","330600315818","开关电源","开关电源",14210.19,426.31,13783.88,"架",1,"200A-",null,"柯桥柯桥梅巷2","330621500000000026"]
[69,"绍兴市分公司党委2024年第23次党委会会议纪要","330600319318","开关电源","开关电源",9788.4,293.65,9494.75,"架",1,"48V/600A高效系统(50A高效模块)150A",null,"柯桥齐贤前进南","330621500000000108"]
[70,"绍兴市分公司党委2024年第23次党委会会议纪要","330600319553","机柜","机柜",13491.63,404.75,13086.88,"个",1,"—48V/200A(32A/3P*2预留4套BBU安装空间自然风冷)",null,"绍兴市嵊州市三江街道麦地朗","330683908000000480"]
[71,"绍兴市分公司党委2024年第23次党委会会议纪要","330600319963","开关电源","开关电源",6700.46,201.01,6499.45,"架",1,"嵌入式开关电源32A/3P*1（室外标准机柜用）",null,"绍兴市诸暨市直埠镇张马","330681908000000814"]
[72,"绍兴市分公司党委2024年第23次党委会会议纪要","330600320249","开关电源","开关电源",5722.28,171.67,5550.61,"架",1,"嵌入式开关电源63A/2P*1（室外标准机柜用）",null,"绍兴市绍兴县齐贤镇上丈午村","330600908000000510"]
[73,"绍兴市分公司党委2024年第23次党委会会议纪要","330600320590","空调","空调",5936.86,178.11,5758.75,"台",1,"3P单冷三相整机",null,"绍兴市虚拟站","330600880000000000"]
[74,"绍兴市分公司党委2024年第23次党委会会议纪要","330600321893","开关电源","开关电源",15880.19,476.41,15403.78,"架",1,"—48V/200A(32A/3P*2预留4套BBU安装空间自然风冷)",null,"绍兴市绍兴县安昌镇华力化纤","330600908000000611"]
[75,"绍兴市分公司党委2024年第23次党委会会议纪要","330600321899","开关电源","开关电源",3588.89,107.67,3481.22,"架",1,"嵌入式开关电源32A/3P*1（室外标准机柜用）",null,"绍兴市上虞市沥海镇滨海昌海生物","330682908000000492"]
[76,"绍兴市分公司党委2024年第23次党委会会议纪要","330600321968","开关电源","开关电源",16703.42,501.1,16202.32,"架",1,"开关电源",null,"上虞滨海闸前大桥","33068201000523"]
[77,"绍兴市分公司党委2024年第23次党委会会议纪要","330600323676","空调","空调",4721.59,141.65,4579.94,"台",1,"2P单冷单相整机",null,"绍兴市虚拟站","330600880000000000"]
[78,"绍兴市分公司党委2024年第23次党委会会议纪要","330600323746","开关电源","开关电源",12549.19,376.48,12172.71,"架",1,"电源机柜一体化电源柜120A-120A（总容量-实际容量）",null,"上虞路东","330682908000000068"]
[79,"绍兴市分公司党委2024年第23次党委会会议纪要","330600326430","开关电源","开关电源",5261.6,157.85,5103.75,"架",1,"48V/300A高效系统(50A高效模块，共用电源系统，三相交流输入)150A",null,"绍兴市越城区皋埠镇后堡","330602908000001034"]
[80,"绍兴市分公司党委2024年第23次党委会会议纪要","330600326961","动环","动环",2883.02,86.49,2796.53,"个",1,"主设备室内型成套设备基本配置模型",null,"绍兴城西北海综合市场","330602500000000001"]
[81,"绍兴市分公司党委2024年第23次党委会会议纪要","330600327208","动环","动环",3561.23,106.84,3454.39,"个",1,"主设备室内型成套设备基本配置模型",null,"绍兴市越城区城南街道城南凤凰路公路站","330602908000000379"]
[82,"绍兴市分公司党委2024年第23次党委会会议纪要","330600327485","空调","空调",6186.69,185.6,6001.09,"台",1,"3P单冷三相整机",null,"绍兴市新昌县七星街道宋家","330624908000000237"]
[83,"绍兴市分公司党委2024年第23次党委会会议纪要","330600327596","空调","空调",5532.04,165.96,5366.08,"台",1,"3P单冷三相整机",null,"嵊州三江西街","330683908000000995"]
[84,"绍兴市分公司党委2024年第21次党委会会议纪要","330600327670","动环","动环",1147.08,34.41,1112.67,"个",1,"主设备室外型拉远站用FSU设备常温48V直流型",null,"绍兴市越城区城南街道城南凤凰路公路站","330602908000000379"]
[85,"绍兴市分公司党委2024年第23次党委会会议纪要","330600328257","空调","空调",6888.27,206.65,6681.62,"台",1,"3P单冷三相整机",null,"绍兴市绍兴县马鞍镇滨海盛兴印染","330600908000000456"]
[86,"绍兴市分公司党委2024年第21次党委会会议纪要","330600329913","电表","电表",599.04,17.97,581.07,"个",1,"门禁设备",null,"上虞崧夏光明","33068201000490"]
[87,"绍兴市分公司党委2024年第23次党委会会议纪要","330600330178","空调","空调",6213.28,186.4,6026.88,"台",1,"3P单冷三相整机",null,"绍兴市诸暨市暨阳街道郭家","330681908000000390"]
[88,"绍兴市分公司党委2024年第23次党委会会议纪要","330600330762","空调","空调",4208.61,126.26,4082.35,"台",1,"2P单冷单相整机",null,"诸暨牌头东山王北","330681500000000329"]
[89,"绍兴市分公司党委2024年第23次党委会会议纪要","330600331226","空调","空调",4153.29,124.6,4028.69,"台",1,"2P单冷单相整机",null,"绍兴城西柯能轿修东搬迁","330602500000000300"]
[90,"绍兴市分公司党委2024年第21次党委会会议纪要","330600334530","开关电源","开关电源",6410.57,192.32,6218.25,"架",1,"48V/600A高效系统(50A高效模块)150A",null,"绍兴越城袍江新和照明","330602500000001567"]
[91,"绍兴市分公司党委2024年第21次党委会会议纪要","330600334533","配电箱","配电箱",1952.08,58.56,1893.52,"个",1,"交流配电箱三相（含市电油机手动转换开关）380V/100A室内型",null,"绍兴越城袍江新和照明","330602500000001567"]
[92,"绍兴市分公司党委2024年第23次党委会会议纪要","330600334808","开关电源","开关电源",13544.68,406.34,13138.34,"架",1,"综合柜（PU）*1+设备柜（PU）*1",null,"柯桥滨海通盛印染","330621500000001620"]
[93,"绍兴市分公司党委2024年第23次党委会会议纪要","330600337225","空调","空调",6914.49,393.74,6520.75,"台",1,"3P单冷三相整机",null,"绍兴市虚拟站","330600880000000000"]
[94,"绍兴市分公司党委2024年第23次党委会会议纪要","330600362194","电表","电表",521.68,327.56,194.12,"个",1,"直流计量终端6分路",null,"诸暨青塔-2","330681908000000073"]
[95,"绍兴市分公司党委2024年第23次党委会会议纪要","330600399636","配电箱","配电箱",4180.94,3279.98,900.96,"台",1,"直流配电设备智能配电单元分户下电1U",null,"绍兴城南长城路NR","330602500010002141"]
[96,"绍兴市分公司党委2023年第21次党委会会议纪要","330600366464","外市电引入","外市电引入",13980.19,10365.09,3615.1,"米",{"v":100,"d":"100.000"},"非模块化外市电引入直供380V（非模块化）",null,"上虞百官新宇新村南搬迁","330682500000001729"]
[97,"绍兴市分公司党委2024年第23次党委会会议纪要","无*1x25红**绍兴城东京东方东NR*330602500010002186**无*拆站*废旧","电池线","电池线",0,null,0,"米",2]
[98,"绍兴市分公司党委2024年第23次党委会会议纪要","无*1x25蓝**绍兴城东京东方东NR*330602500010002186**无*拆站*废旧","电池线","电池线",0,null,0,"米",2]
[99,"绍兴市分公司党委2024年第23次党委会会议纪要","无*1x95红*①*绍兴市越城区皋埠镇刁泥山村*330602908000000319**无*拆站*废旧","电池线","电池线",0,null,0,"米",3]
[100,"绍兴市分公司党委2024年第23次党委会会议纪要","无*1x95红*②*绍兴市越城区皋埠镇刁泥山村*330602908000000319**无*拆站*废旧","电池线","电池线",0,null,0,"米",3]
[101,"绍兴市分公司党委2024年第23次党委会会议纪要","无*1x95蓝*①*绍兴市越城区皋埠镇刁泥山村*330602908000000319**无*拆站*废旧","电池线","电池线",0,null,0,"米",3]
[102,"绍兴市分公司党委2024年第23次党委会会议纪要","无*1x95蓝*②*绍兴市越城区皋埠镇刁泥山村*330602908000000319**无*拆站*废旧","电池线","电池线",0,null,0,"米",3]
[103,"绍兴市分公司党委2024年第23次党委会会议纪要","无*4x16黑**绍兴洋江*330602908000000236**无*拆站*废旧","电池线","电池线",0,null,0,"米",4]
[104,"绍兴市分公司党委2024年第23次党委会会议纪要","无*4x35铝线**绍兴城东京东方东NR*330602500010002186**无*拆站*废旧","(废旧物资)-铝线","(废旧物资)-铝线",0,null,0,"米",2]
[105,"绍兴市分公司党委2024年第23次党委会会议纪要","无*95方铜-黑**绍兴洋江*330602908000000236**无*拆站*废旧","电池线","电池线",0,null,0,"米",4]
[106,"绍兴市分公司党委2024年第23次党委会会议纪要","无*95方铜-红**绍兴洋江*330602908000000236**无*拆站*废旧","电池线","电池线",0,null,0,"米",4]
[107,"绍兴市分公司党委2024年第23次党委会会议纪要","无*95方铜-蓝*①*绍兴洋江*330602908000000236**无*拆站*废旧","电池线","电池线",0,null,0,"米",4]
[108,"绍兴市分公司党委2024年第23次党委会会议纪要","无*95方铜-蓝*②*绍兴洋江*330602908000000236**无*拆站*废旧","电池线","电池线",0,null,0,"米",4]
[109,"绍兴市分公司党委2024年第23次党委会会议纪要","无*汇流条**柯桥钱清新甸搬迁*330621500000000249**无*拆站*废旧","汇流条","汇流条",0,null,0,"段",4]
[110,"绍兴市分公司党委2024年第23次党委会会议纪要","无*汇流条**绍兴市越城区皋埠镇刁泥山村*330602908000000319**无*拆站*废旧","汇流条","汇流条",0,null,0,"段",2]
[111,"绍兴市分公司党委2024年第23次党委会会议纪要","无*铜牌**柯桥钱清新甸搬迁*330621500000000249**无*拆站*废旧","铜牌","铜牌",0,null,0,"块",3]
[112,"绍兴市分公司党委2024年第23次党委会会议纪要","无*铜牌**绍兴市越城区皋埠镇刁泥山村*330602908000000319**无*拆站*废旧","铜牌","铜牌",0,null,0,"块",2]
[113,"绍兴市分公司党委2024年第23次党委会会议纪要","无*铜牌**绍兴洋江*330602908000000236**无*拆站*废旧","铜牌","铜牌",0,null,0,"块",1]